program: Orca
programVersion: 5.0.2
elementType: S O O O N N C C C C C C C C C C C C C C C C C C C C H H H H H H H H H H H H H H H H H H H H H H H H H H H H H H H H
charge: 0
multiplicity: 1
keywords: wb97x-d3
keywords: def2-TZVPP
keywords: def2/J RIJCOSX
keywords: DEFGRID2
keywords: scfconv7
keywords: smallprint printgap noloewdin
keywords: NOSOSCF
formula: C20H32N2O3S
InChI: InChI=1/C20H32N2O3S/c1-6-8-13-22(14-9-7-2)26-21(5)19(23)24-17-12-10-11-16-15-20(3,4)25-18(16)17/h10-12H,6-9,13-15H2,1-5H3
58 atoms
S  -1.997646 0.902701 0.151322
O  1.398458 -2.393962 1.81094
O  0.456758 -0.486984 -0.056845
O  1.681098 0.823165 1.296544
N  -2.01199 1.891799 -1.186435
N  -0.541427 1.213317 1.023231
C  2.267865 -3.272492 2.598948
C  3.239456 -3.900617 1.570948
C  3.075988 -3.009999 0.378017
C  1.983137 -2.194075 0.61952
C  1.384145 -4.291599 3.283068
C  3.002664 -2.393869 3.594799
C  3.763404 -2.911966 -0.817138
C  1.568089 -1.261514 -0.311093
C  3.340729 -1.981805 -1.765245
C  2.25105 -1.156965 -1.512347
C  -1.080318 1.56202 -2.266395
C  -2.190775 3.329041 -0.972536
C  -1.294458 0.190273 -2.884205
C  -3.391794 3.688768 -0.116676
C  -2.674856 -0.015001 -3.493157
C  -3.619605 5.195308 -0.074443
C  0.616082 0.545445 0.789702
C  -2.778561 -1.324817 -4.259364
C  -4.800773 5.574703 0.805247
C  -0.472764 2.350753 1.934097
H  2.960955 -4.930677 1.332094
H  4.261196 -3.922662 1.952053
H  0.671993 -3.813694 3.957309
H  1.996304 -4.972356 3.874698
H  0.830115 -4.886656 2.556141
H  3.660694 -3.001547 4.21639
H  2.304144 -1.874804 4.252605
H  3.618493 -1.647824 3.088688
H  4.616368 -3.547489 -1.017691
H  3.867337 -1.891615 -2.705475
H  1.928158 -0.429479 -2.247021
H  -0.038667 1.671904 -1.938565
H  -1.227794 2.315224 -3.04411
H  -2.32905 3.769843 -1.962809
H  -1.282255 3.786087 -0.558787
H  -0.534198 0.078607 -3.663925
H  -1.095826 -0.599147 -2.156858
H  -4.282032 3.195161 -0.516979
H  -3.265211 3.320021 0.903736
H  -2.906501 0.819582 -4.162157
H  -3.433003 0.004146 -2.707012
H  -2.716196 5.691546 0.292229
H  -3.782808 5.570262 -1.088891
H  -3.777802 -1.468697 -4.672286
H  -2.564164 -2.18006 -3.615508
H  -2.071927 -1.356188 -5.090881
H  -5.72434 5.1161 0.447322
H  -4.955604 6.654018 0.824645
H  -4.649145 5.245399 1.834822
H  0.0135 2.072902 2.86779
H  -1.483824 2.669254 2.167719
H  0.062538 3.192374 1.49432
elementType: S O N C H
totalener: -1514.91204242 hartree
nucrepener: 2681.67462009 hartree
electener: -4196.58666251 hartree
oneelecener: -7402.84698105 hartree
twoeener: 3206.26031854 hartree
cpcmener: -0.03427440 hartree
kineticenergy: 1509.10749695 hartree
xcener: -129.014377106483 hartree
chargesum: -0.0000000
charge: 0.017179 -0.381485 -0.317295 -0.518175 -0.133477 -0.156637 0.379605 -0.112057 -0.093440 0.251212 -0.298261 -0.327005 -0.203061 0.084091 -0.164364 -0.175482 -0.117739 -0.124213 -0.139681 -0.094810 -0.066601 -0.080195 0.497566 -0.283945 -0.286076 -0.188720 0.092861 0.099674 0.100371 0.101525 0.097806 0.102621 0.099954 0.108445 0.153376 0.160191 0.151942 0.113111 0.107044 0.101192 0.094245 0.077377 0.062775 0.068945 0.058257 0.059086 0.049780 0.057934 0.061430 0.090198 0.079620 0.078833 0.079415 0.091199 0.079676 0.119994 0.113568 0.120621
qa: 0.0172 -0.3815 -0.3173 -0.5182 -0.1335 -0.1566 0.3796 -0.1121 -0.0934 0.2512 -0.2983 -0.3270 -0.2031 0.0841 -0.1644 -0.1755 -0.1177 -0.1242 -0.1397 -0.0948 -0.0666 -0.0802 0.4976 -0.2839 -0.2861 -0.1887 0.0929 0.0997 0.1004 0.1015 0.0978 0.1026 0.1000 0.1084 0.1534 0.1602 0.1519 0.1131 0.1070 0.1012 0.0942 0.0774 0.0628 0.0689 0.0583 0.0591 0.0498 0.0579 0.0614 0.0902 0.0796 0.0788 0.0794 0.0912 0.0797 0.1200 0.1136 0.1206
va: 2.3310 2.0792 2.0922 1.9879 3.0120 3.1815 3.6723 3.9893 3.6572 3.9531 3.9521 3.9800 3.9584 3.8635 3.8775 3.9669 3.8923 3.9212 3.8437 3.8443 3.8639 3.8814 4.2454 3.9525 3.9510 3.8876 1.0090 1.0038 1.0061 1.0024 1.0046 1.0057 1.0079 0.9984 0.9977 0.9896 0.9964 1.0041 0.9976 0.9991 0.9871 1.0116 1.0236 1.0184 1.0211 1.0096 1.0208 1.0083 1.0083 1.0040 0.9997 1.0010 0.9997 1.0040 0.9999 1.0008 0.9991 0.9885
dispcorr: -0.029889840 hartree
energy: -1514.941932259781
dipole: -18.77516 18.87856 0.10341 14.42455 -14.33497 0.08959 -5.63497 5.26133 -0.37365
magnitude: 0.39791 au
magnitude: 1.01140 debye
