program: Orca
programVersion: 5.0.2
elementType: S O O O N N C C C C C C C C C C C C C C C C C C C C H H H H H H H H H H H H H H H H H H H H H H H H H H H H H H H H
charge: 0
multiplicity: 1
keywords: wb97x-d3
keywords: def2-TZVPP
keywords: def2/J RIJCOSX
keywords: DEFGRID2
keywords: scfconv7
keywords: smallprint printgap noloewdin
keywords: NOSOSCF
formula: C20H32N2O3S
InChI: InChI=1/C20H32N2O3S/c1-6-8-13-22(14-9-7-2)26-21(5)19(23)24-17-12-10-11-16-15-20(3,4)25-18(16)17/h10-12H,6-9,13-15H2,1-5H3
58 atoms
S  -1.846025 1.896862 0.965966
O  1.599524 -1.493152 -0.025048
O  0.827975 0.982244 1.207911
O  0.453558 -0.721234 2.627403
N  -2.373261 1.267242 -0.469808
N  -1.261365 0.602326 1.947539
C  2.342622 -2.720029 -0.324412
C  3.806885 -2.256457 -0.481272
C  3.803424 -0.943145 0.240042
C  2.478344 -0.590578 0.441317
C  1.758194 -3.31724 -1.583785
C  2.181922 -3.641677 0.87161
C  4.819247 -0.102813 0.65411
C  2.143363 0.596015 1.067533
C  4.487153 1.096123 1.281533
C  3.157616 1.440967 1.491253
C  -3.598221 0.467293 -0.472362
C  -1.372607 0.890497 -1.469751
C  -4.536961 0.841111 -1.609414
C  -0.620648 2.088997 -2.026288
C  -5.802353 -0.006255 -1.612652
C  0.34255 1.73441 -3.155317
C  0.035048 0.207498 1.97163
C  -6.776145 0.412301 -2.703003
C  1.544737 0.908686 -2.720272
C  -2.210574 -0.195185 2.715101
H  4.075357 -2.121492 -1.533045
H  4.503044 -2.981437 -0.05855
H  1.834471 -2.624896 -2.423077
H  0.710042 -3.586974 -1.448291
H  2.302993 -4.223704 -1.847627
H  2.70595 -4.580587 0.691423
H  1.131553 -3.872631 1.052769
H  2.598395 -3.197543 1.777766
H  5.856295 -0.368134 0.493852
H  5.267232 1.765522 1.617143
H  2.902516 2.371925 1.981506
H  -4.113294 0.629364 0.475093
H  -3.353625 -0.600997 -0.515392
H  -1.904463 0.405208 -2.290241
H  -0.689148 0.134405 -1.068772
H  -4.804968 1.896636 -1.511729
H  -4.03182 0.734475 -2.573859
H  -1.355508 2.806969 -2.398342
H  -0.070065 2.592511 -1.226965
H  -6.29314 0.068611 -0.638042
H  -5.537521 -1.059241 -1.740897
H  -0.200179 1.20676 -3.945207
H  0.697513 2.66422 -3.605911
H  -7.091213 1.449005 -2.574637
H  -7.673812 -0.206396 -2.696776
H  -6.324371 0.326936 -3.692656
H  1.258874 -0.083099 -2.370963
H  2.089624 1.401993 -1.912812
H  2.242363 0.76946 -3.547119
H  -2.386731 -1.167531 2.254482
H  -3.154216 0.339865 2.759693
H  -1.863128 -0.346704 3.735895
elementType: S O N C H
totalener: -1514.91229902 hartree
nucrepener: 2756.41799670 hartree
electener: -4271.33029572 hartree
oneelecener: -7552.38277757 hartree
twoeener: 3281.05248185 hartree
cpcmener: -0.03236961 hartree
kineticenergy: 1509.11511226 hartree
xcener: -129.017938751494 hartree
chargesum: 0.0000000
charge: 0.012896 -0.375682 -0.314372 -0.514174 -0.135166 -0.162274 0.371268 -0.124559 -0.062376 0.243547 -0.303969 -0.332070 -0.188873 0.080078 -0.158021 -0.206319 -0.092458 -0.141838 -0.099887 -0.088619 -0.082459 -0.100322 0.497010 -0.282309 -0.267442 -0.180317 0.090843 0.102993 0.100554 0.102577 0.109320 0.104109 0.100309 0.109324 0.152392 0.159801 0.150519 0.092787 0.099802 0.112252 0.091552 0.054827 0.066394 0.076806 0.062598 0.058429 0.059429 0.056204 0.070697 0.079495 0.090868 0.079238 0.060367 0.072276 0.098312 0.125272 0.103388 0.114976
qa: 0.0129 -0.3757 -0.3144 -0.5142 -0.1352 -0.1623 0.3713 -0.1246 -0.0624 0.2435 -0.3040 -0.3321 -0.1889 0.0801 -0.1580 -0.2063 -0.0925 -0.1418 -0.0999 -0.0886 -0.0825 -0.1003 0.4970 -0.2823 -0.2674 -0.1803 0.0908 0.1030 0.1006 0.1026 0.1093 0.1041 0.1003 0.1093 0.1524 0.1598 0.1505 0.0928 0.0998 0.1123 0.0916 0.0548 0.0664 0.0768 0.0626 0.0584 0.0594 0.0562 0.0707 0.0795 0.0909 0.0792 0.0604 0.0723 0.0983 0.1253 0.1034 0.1150
va: 2.3416 2.0330 2.0813 1.9911 3.0159 3.1715 3.7188 3.9949 3.6396 3.8618 3.9274 3.9734 3.9569 3.7699 3.8692 3.9908 3.9123 3.9077 3.8620 3.8454 3.8760 3.9147 4.2443 3.9494 3.9427 3.8804 1.0102 1.0041 0.9986 1.0067 1.0033 1.0068 1.0095 0.9984 0.9965 0.9881 0.9986 1.0062 0.9942 0.9937 1.0125 1.0211 1.0164 1.0187 1.0278 1.0065 1.0085 1.0089 1.0060 0.9998 1.0039 1.0006 1.0072 1.0007 1.0062 0.9855 1.0102 1.0014
dispcorr: -0.032597965 hartree
energy: -1514.944896980835
dipole: -20.18989 19.93315 -0.25674 -10.56590 9.50906 -1.05683 -26.52653 24.90204 -1.62449
magnitude: 1.95494 au
magnitude: 4.96907 debye
