program: Orca
programVersion: 5.0.2
elementType: S O O O N N C C C C C C C C C C C C C C C C C C C C H H H H H H H H H H H H H H H H H H H H H H H H H H H H H H H H
charge: 0
multiplicity: 1
keywords: wb97x-d3
keywords: def2-TZVPP
keywords: def2/J RIJCOSX
keywords: DEFGRID2
keywords: scfconv7
keywords: smallprint printgap noloewdin
keywords: NOSOSCF
formula: C20H32N2O3S
InChI: InChI=1/C20H32N2O3S/c1-6-8-13-22(14-9-7-2)26-21(5)19(23)24-17-12-10-11-16-15-20(3,4)25-18(16)17/h10-12H,6-9,13-15H2,1-5H3
58 atoms
S  -2.320765 0.799198 0.871888
O  1.336878 -2.335217 1.8185
O  0.099465 -0.441996 0.07014
O  1.511501 0.779774 1.322701
N  -2.734817 1.559309 -0.537119
N  -0.712141 1.237475 1.324607
C  2.374431 -3.141863 2.467596
C  3.102703 -3.848435 1.303338
C  2.741958 -2.986469 0.132869
C  1.705679 -2.15971 0.537269
C  1.689084 -4.098575 3.417485
C  3.298438 -2.179347 3.19488
C  3.222686 -2.920696 -1.160621
C  1.148187 -1.241634 -0.332295
C  2.652898 -2.00709 -2.045696
C  1.625278 -1.167957 -1.632138
C  -2.248543 1.029983 -1.810311
C  -2.978311 2.997411 -0.512619
C  -2.636152 -0.420406 -2.04928
C  -1.762502 3.87949 -0.767838
C  -2.119038 -0.958148 -3.37997
C  -2.112313 5.358419 -0.675247
C  0.386196 0.542495 0.9410
C  -2.731508 -0.289571 -4.603201
C  -0.915594 6.258268 -0.94227
C  -0.496886 2.350832 2.240475
H  2.738456 -4.870135 1.162033
H  4.176831 -3.907973 1.481563
H  2.433982 -4.725102 3.908374
H  0.997476 -4.754875 2.888018
H  1.138903 -3.56613 4.194447
H  3.773514 -1.480946 2.502774
H  4.08881 -2.732096 3.703384
H  2.755359 -1.603219 3.945122
H  4.029245 -3.566139 -1.483866
H  3.016832 -1.939466 -3.06177
H  1.189329 -0.451423 -2.317518
H  -1.1634 1.150623 -1.912517
H  -2.6965 1.656756 -2.584912
H  -3.420103 3.244713 0.454846
H  -3.739736 3.215521 -1.268398
H  -2.247535 -1.04414 -1.242342
H  -3.725947 -0.511859 -2.015786
H  -0.974286 3.652873 -0.046401
H  -1.348131 3.666315 -1.757816
H  -2.325549 -2.030211 -3.421421
H  -1.029072 -0.86105 -3.412878
H  -2.91162 5.590752 -1.385211
H  -2.516312 5.572808 0.318677
H  -2.468836 0.76681 -4.672271
H  -3.821186 -0.357175 -4.582911
H  -2.390679 -0.766857 -5.522842
H  -1.181995 7.312673 -0.859793
H  -0.514967 6.097727 -1.944818
H  -0.109403 6.065967 -0.23198
H  -1.437622 2.875086 2.377243
H  0.23213 3.059076 1.848124
H  -0.156824 2.003972 3.216996
elementType: S O N C H
totalener: -1514.91190224 hartree
nucrepener: 2710.51199665 hartree
electener: -4225.42389888 hartree
oneelecener: -7460.50591378 hartree
twoeener: 3235.08201490 hartree
cpcmener: -0.03396728 hartree
kineticenergy: 1509.10062205 hartree
xcener: -129.016230514438 hartree
chargesum: -0.0000000
charge: 0.016081 -0.384852 -0.320991 -0.518087 -0.139646 -0.169533 0.378361 -0.102369 -0.083021 0.228148 -0.294251 -0.334407 -0.209191 0.126559 -0.161848 -0.214257 -0.119703 -0.103523 -0.122576 -0.113100 -0.102490 -0.084087 0.509046 -0.284157 -0.274090 -0.192401 0.091319 0.099887 0.100766 0.097268 0.100459 0.108982 0.103604 0.100493 0.152993 0.160499 0.161045 0.092096 0.111328 0.096979 0.093380 0.074469 0.075231 0.067128 0.080909 0.074505 0.049689 0.059715 0.059829 0.081339 0.082273 0.092543 0.091270 0.078890 0.079130 0.108799 0.112868 0.130700
qa: 0.0161 -0.3849 -0.3210 -0.5181 -0.1396 -0.1695 0.3784 -0.1024 -0.0830 0.2281 -0.2943 -0.3344 -0.2092 0.1266 -0.1618 -0.2143 -0.1197 -0.1035 -0.1226 -0.1131 -0.1025 -0.0841 0.5090 -0.2842 -0.2741 -0.1924 0.0913 0.0999 0.1008 0.0973 0.1005 0.1090 0.1036 0.1005 0.1530 0.1605 0.1610 0.0921 0.1113 0.0970 0.0934 0.0745 0.0752 0.0671 0.0809 0.0745 0.0497 0.0597 0.0598 0.0813 0.0823 0.0925 0.0913 0.0789 0.0791 0.1088 0.1129 0.1307
va: 2.3410 2.0796 2.0892 1.9896 3.0290 3.1512 3.6859 3.9656 3.6434 3.9660 3.9426 3.9790 3.9658 3.8081 3.8865 3.9723 3.9043 3.9232 3.8601 3.7952 3.8960 3.8872 4.2354 3.9391 3.9395 3.8821 1.0103 1.0042 1.0027 1.0059 1.0061 0.9988 1.0066 1.0084 0.9981 0.9900 0.9893 0.9926 0.9865 1.0103 0.9995 1.0297 1.0172 1.0027 1.0117 1.0068 1.0125 1.0096 1.0070 0.9978 1.0004 1.0039 1.0042 1.0015 1.0009 1.0062 0.9899 0.9977
dispcorr: -0.030799974 hartree
energy: -1514.942702209637
dipole: -7.83469 7.77751 -0.05718 16.50683 -16.54656 -0.03973 -11.79066 11.18159 -0.60907
magnitude: 0.61304 au
magnitude: 1.55822 debye
