program: Orca
programVersion: 5.0.2
elementType: S O O O N N C C C C C C C C C C C C C C C C C C C C H H H H H H H H H H H H H H H H H H H H H H H H H H H H H H H H
charge: 0
multiplicity: 1
keywords: wb97x-d3
keywords: def2-TZVPP
keywords: def2/J RIJCOSX
keywords: DEFGRID2
keywords: scfconv7
keywords: smallprint printgap noloewdin
keywords: NOSOSCF
formula: C20H32N2O3S
InChI: InChI=1/C20H32N2O3S/c1-6-8-13-22(14-9-7-2)26-21(5)19(23)24-17-12-10-11-16-15-20(3,4)25-18(16)17/h10-12H,6-9,13-15H2,1-5H3
58 atoms
S  -1.671276 2.226952 0.788257
O  0.789132 -1.329729 -0.017627
O  0.755202 1.005666 1.589556
O  -0.134042 -0.584819 2.905875
N  -1.780185 1.40526 -0.634122
N  -1.448241 1.051006 2.032772
C  1.125632 -2.608804 -0.648366
C  2.670706 -2.696288 -0.584545
C  3.032332 -1.586243 0.352777
C  1.881886 -0.858586 0.600432
C  0.592403 -2.56564 -2.064157
C  0.469378 -3.698933 0.177894
C  4.233709 -1.195629 0.914817
C  1.900801 0.260116 1.414275
C  4.260989 -0.066429 1.730041
C  3.100502 0.656775 1.982156
C  -3.074555 1.027464 -1.192019
C  -0.641999 1.415248 -1.544363
C  -3.204218 -0.453075 -1.527364
C  -0.540086 2.675448 -2.3923
C  -3.085591 -1.380957 -0.328351
C  0.642906 2.624596 -3.349239
C  -0.272833 0.405531 2.222716
C  -3.328405 -2.838262 -0.69045
C  0.783642 3.892955 -4.175659
C  -2.608888 0.515136 2.734447
H  3.122539 -2.543453 -1.567978
H  2.997694 -3.674406 -0.228454
H  -0.490737 -2.429891 -2.079784
H  0.815654 -3.504403 -2.571831
H  1.052654 -1.758972 -2.636031
H  -0.614333 -3.574515 0.209041
H  0.845834 -3.701229 1.202521
H  0.681767 -4.676024 -0.25698
H  5.140988 -1.753756 0.72258
H  5.19168 0.253876 2.177874
H  3.125121 1.533269 2.616983
H  -3.270564 1.615449 -2.09597
H  -3.845528 1.303406 -0.470978
H  -0.713082 0.538038 -2.194012
H  0.276217 1.293058 -0.971541
H  -4.183288 -0.588888 -1.997853
H  -2.469301 -0.73595 -2.288104
H  -1.464456 2.820769 -2.959908
H  -0.439142 3.542888 -1.73152
H  -3.805196 -1.072824 0.436196
H  -2.096378 -1.277168 0.124973
H  1.56234 2.455339 -2.780419
H  0.535953 1.762496 -4.014504
H  -4.331261 -2.983367 -1.097059
H  -3.229909 -3.488691 0.179676
H  -2.618062 -3.187249 -1.44262
H  -0.107466 4.072665 -4.779711
H  1.635418 3.837191 -4.854593
H  0.928887 4.766373 -3.537433
H  -2.462575 0.560173 3.813249
H  -2.822773 -0.514685 2.451833
H  -3.472808 1.12466 2.487484
elementType: S O N C H
totalener: -1514.90883049 hartree
nucrepener: 2834.48506423 hartree
electener: -4349.39389472 hartree
oneelecener: -7708.36219070 hartree
twoeener: 3358.96829598 hartree
cpcmener: -0.03271797 hartree
kineticenergy: 1509.10966895 hartree
xcener: -129.021358478982 hartree
chargesum: 0.0000000
charge: 0.018140 -0.371352 -0.324170 -0.507212 -0.150675 -0.134665 0.373964 -0.126208 -0.121524 0.328254 -0.321930 -0.332557 -0.178622 0.080717 -0.160258 -0.214159 -0.077882 -0.093602 -0.115393 -0.107852 -0.064626 -0.082614 0.472248 -0.317082 -0.280349 -0.188084 0.094520 0.099846 0.085368 0.117458 0.104885 0.102932 0.111254 0.108465 0.152727 0.159253 0.150487 0.097870 0.090817 0.094167 0.086477 0.079097 0.070846 0.066093 0.054573 0.071095 0.011694 0.058147 0.059550 0.097962 0.096921 0.084178 0.078584 0.090718 0.079006 0.127534 0.110324 0.104650
qa: 0.0181 -0.3714 -0.3242 -0.5072 -0.1507 -0.1347 0.3740 -0.1262 -0.1215 0.3283 -0.3219 -0.3326 -0.1786 0.0807 -0.1603 -0.2142 -0.0779 -0.0936 -0.1154 -0.1079 -0.0646 -0.0826 0.4722 -0.3171 -0.2803 -0.1881 0.0945 0.0998 0.0854 0.1175 0.1049 0.1029 0.1113 0.1085 0.1527 0.1593 0.1505 0.0979 0.0908 0.0942 0.0865 0.0791 0.0708 0.0661 0.0546 0.0711 0.0117 0.0581 0.0595 0.0980 0.0969 0.0842 0.0786 0.0907 0.0790 0.1275 0.1103 0.1046
va: 2.3635 2.0577 2.0769 1.9928 3.0138 3.1447 3.6813 4.0226 3.7148 3.8573 3.9510 3.9927 3.9405 3.7496 3.8742 3.9927 3.9154 3.9627 3.8032 3.9229 3.8309 3.8817 4.2828 3.9565 3.9493 3.8915 1.0075 1.0043 1.0082 1.0065 1.0024 0.9960 0.9993 1.0048 0.9960 0.9881 0.9991 0.9984 1.0119 0.9922 1.0082 1.0156 1.0018 1.0146 1.0187 1.0073 1.0232 1.0072 1.0077 1.0043 0.9988 0.9933 1.0009 1.0035 1.0004 0.9967 0.9865 1.0111
dispcorr: -0.035350028 hartree
energy: -1514.944180517720
dipole: -13.92754 13.67242 -0.25513 -9.70257 8.92498 -0.77759 -28.98267 26.74063 -2.24204
magnitude: 2.38673 au
magnitude: 6.06658 debye
