program: Orca
programVersion: 5.0.2
elementType: S O O O N N C C C C C C C C C C C C C C C C C C C C H H H H H H H H H H H H H H H H H H H H H H H H H H H H H H H H
charge: 0
multiplicity: 1
keywords: wb97x-d3
keywords: def2-TZVPP
keywords: def2/J RIJCOSX
keywords: DEFGRID2
keywords: scfconv7
keywords: smallprint printgap noloewdin
keywords: NOSOSCF
formula: C20H32N2O3S
InChI: InChI=1/C20H32N2O3S/c1-6-8-13-22(14-9-7-2)26-21(5)19(23)24-17-12-10-11-16-15-20(3,4)25-18(16)17/h10-12H,6-9,13-15H2,1-5H3
58 atoms
S  -1.715529 2.147624 0.48354
O  1.024377 -1.68604 0.15389
O  0.761663 0.957911 1.192041
O  0.001903 -0.467996 2.755064
N  -1.921788 1.444113 -0.996735
N  -1.430379 0.926604 1.676402
C  1.515372 -2.95573 -0.391386
C  3.058294 -2.901742 -0.24426
C  3.297594 -1.57101 0.398464
C  2.069293 -0.957867 0.572308
C  1.074052 -3.017187 -1.839808
C  0.901402 -4.065606 0.437505
C  4.458351 -0.92587 0.78457
C  1.974021 0.308811 1.124512
C  4.368326 0.344381 1.348648
C  3.132728 0.957724 1.520005
C  -3.120057 0.646049 -1.235037
C  -0.751134 1.060121 -1.785945
C  -2.973678 -0.845574 -0.949642
C  0.26169 2.172802 -1.9931
C  -4.284945 -1.605054 -1.133061
C  -0.288104 3.402909 -2.701986
C  -0.210338 0.401266 1.937981
C  -5.336543 -1.281801 -0.080117
C  0.79585 4.425861 -3.005723
C  -2.554166 0.386464 2.433395
H  3.554045 -2.977165 -1.214448
H  3.430125 -3.725346 0.368659
H  1.503789 -2.198478 -2.419105
H  -0.012987 -2.970061 -1.926288
H  1.405382 -3.953484 -2.289627
H  1.232349 -5.03428 0.062228
H  -0.188208 -4.042958 0.389461
H  1.20489 -3.991779 1.482929
H  5.423467 -1.39596 0.645581
H  5.264967 0.864227 1.657375
H  3.065964 1.949406 1.949041
H  -3.40397 0.776138 -2.284815
H  -3.92438 1.078499 -0.638164
H  -1.133974 0.753253 -2.763632
H  -0.253965 0.180287 -1.366435
H  -2.220035 -1.269257 -1.619388
H  -2.603699 -1.004321 0.066773
H  0.708982 2.466507 -1.040762
H  1.07505 1.746542 -2.588507
H  -4.074556 -2.676692 -1.105696
H  -4.686696 -1.402913 -2.130815
H  -0.775873 3.097746 -3.632937
H  -1.063555 3.870214 -2.09062
H  -6.238128 -1.876798 -0.231202
H  -5.637295 -0.233537 -0.101703
H  -4.966018 -1.496894 0.924288
H  1.281771 4.771118 -2.091094
H  0.389568 5.302608 -3.511593
H  1.571235 4.005705 -3.649065
H  -3.470657 0.83007 2.05663
H  -2.470693 0.629454 3.492922
H  -2.629393 -0.695307 2.327637
elementType: S O N C H
totalener: -1514.91028590 hartree
nucrepener: 2803.84890620 hartree
electener: -4318.75919211 hartree
oneelecener: -7646.95097866 hartree
twoeener: 3328.19178656 hartree
cpcmener: -0.03281154 hartree
kineticenergy: 1509.09592404 hartree
xcener: -129.016398607929 hartree
chargesum: -0.0000000
charge: 0.012167 -0.373142 -0.313982 -0.511569 -0.146682 -0.160262 0.365819 -0.152083 -0.106608 0.373685 -0.323955 -0.316337 -0.170460 0.023297 -0.164420 -0.202595 -0.091216 -0.079052 -0.113786 -0.151049 -0.102632 -0.063561 0.485415 -0.279593 -0.286628 -0.190939 0.098569 0.099020 0.106307 0.098444 0.114735 0.103536 0.100268 0.104545 0.153157 0.159386 0.149612 0.093926 0.098014 0.110916 0.064834 0.078551 0.072262 0.066637 0.078152 0.071018 0.056970 0.059750 0.050792 0.096200 0.081566 0.078038 0.079382 0.090000 0.079211 0.103904 0.131487 0.110978
qa: 0.0122 -0.3731 -0.3140 -0.5116 -0.1467 -0.1603 0.3658 -0.1521 -0.1066 0.3737 -0.3240 -0.3163 -0.1705 0.0233 -0.1644 -0.2026 -0.0912 -0.0791 -0.1138 -0.1510 -0.1026 -0.0636 0.4854 -0.2796 -0.2866 -0.1909 0.0986 0.0990 0.1063 0.0984 0.1147 0.1035 0.1003 0.1045 0.1532 0.1594 0.1496 0.0939 0.0980 0.1109 0.0648 0.0786 0.0723 0.0666 0.0782 0.0710 0.0570 0.0597 0.0508 0.0962 0.0816 0.0780 0.0794 0.0900 0.0792 0.1039 0.1315 0.1110
va: 2.3483 2.0551 2.0687 1.9972 3.0150 3.1549 3.7030 4.0657 3.7060 3.8160 3.9538 3.9727 3.9324 3.7560 3.8723 3.9791 3.8813 3.8895 3.8487 3.8915 3.9117 3.8577 4.2719 3.9275 3.9522 3.8863 1.0045 1.0045 0.9994 1.0050 1.0050 1.0034 1.0052 1.0003 0.9954 0.9883 0.9996 1.0030 1.0109 0.9941 1.0248 1.0172 1.0078 1.0220 1.0124 1.0051 1.0092 1.0098 1.0188 1.0060 0.9993 1.0005 0.9999 1.0039 1.0006 1.0084 0.9984 0.9879
dispcorr: -0.033560203 hartree
energy: -1514.943846106708
dipole: -17.16363 17.05204 -0.11159 -8.30805 7.02394 -1.28411 -22.53258 20.50332 -2.02926
magnitude: 2.40401 au
magnitude: 6.11051 debye
