program: Orca
programVersion: 5.0.2
elementType: S O O O N N C C C C C C C C C C C C C C C C C C C C H H H H H H H H H H H H H H H H H H H H H H H H H H H H H H H H
charge: 0
multiplicity: 1
keywords: wb97x-d3
keywords: def2-TZVPP
keywords: def2/J RIJCOSX
keywords: DEFGRID2
keywords: scfconv7
keywords: smallprint printgap noloewdin
keywords: NOSOSCF
formula: C20H32N2O3S
InChI: InChI=1/C20H32N2O3S/c1-6-8-13-22(14-9-7-2)26-21(5)19(23)24-17-12-10-11-16-15-20(3,4)25-18(16)17/h10-12H,6-9,13-15H2,1-5H3
58 atoms
S  -1.983953 2.276186 0.747891
O  0.752592 -1.568732 0.179806
O  0.522712 1.086826 1.224544
O  -0.075327 -0.35491 2.841275
N  -2.228872 1.645553 -0.751275
N  -1.614783 1.025907 1.89394
C  1.21789 -2.733316 -0.580944
C  2.760333 -2.715906 -0.440529
C  3.030578 -1.358275 0.131346
C  1.809979 -0.79381 0.46259
C  0.779507 -2.529742 -2.018854
C  0.582068 -3.957608 0.039449
C  4.204073 -0.664624 0.361555
C  1.734487 0.471692 1.019787
C  4.135338 0.606087 0.928316
C  2.908398 1.169818 1.25801
C  -3.515664 1.054907 -1.124256
C  -1.097739 1.29462 -1.607161
C  -3.523859 -0.448647 -1.373929
C  -0.039501 2.375758 -1.743799
C  -3.180461 -1.322277 -0.178107
C  1.147506 1.884761 -2.564468
C  -0.373088 0.510254 2.046158
C  -3.255271 -2.803689 -0.516505
C  2.263092 2.914261 -2.648245
C  -2.659925 0.500049 2.764755
H  3.247837 -2.873109 -1.40396
H  3.111105 -3.504435 0.230271
H  -0.30629 -2.439312 -2.091527
H  1.085631 -3.382819 -2.625456
H  1.232007 -1.634747 -2.451043
H  -0.506949 -3.911984 -0.014061
H  0.874358 -4.068876 1.084424
H  0.904488 -4.851951 -0.494272
H  5.162031 -1.096899 0.1024
H  5.042225 1.164599 1.115494
H  2.85851 2.162865 1.686177
H  -3.854099 1.550284 -2.040159
H  -4.236975 1.307924 -0.346274
H  -1.509942 1.09605 -2.599696
H  -0.637162 0.356708 -1.279263
H  -4.530858 -0.698121 -1.724066
H  -2.857115 -0.692267 -2.206925
H  -0.479491 3.256978 -2.220152
H  0.313542 2.697443 -0.763036
H  -3.864849 -1.098985 0.644947
H  -2.176463 -1.086864 0.18411
H  1.539388 0.963608 -2.120304
H  0.814764 1.618472 -3.57208
H  -3.020096 -3.425149 0.348535
H  -2.550748 -3.063981 -1.309354
H  -4.253008 -3.082774 -0.861036
H  2.651721 3.152471 -1.655891
H  1.91427 3.845665 -3.098014
H  3.098245 2.551912 -3.248893
H  -3.607877 0.940097 2.471245
H  -2.473336 0.761218 3.806835
H  -2.746018 -0.582245 2.684885
elementType: S O N C H
totalener: -1514.91005215 hartree
nucrepener: 2881.42159511 hartree
electener: -4396.33164726 hartree
oneelecener: -7802.06886482 hartree
twoeener: 3405.73721757 hartree
cpcmener: -0.03290722 hartree
kineticenergy: 1509.08782155 hartree
xcener: -129.018809307907 hartree
chargesum: 0.0000000
charge: 0.010820 -0.369431 -0.303907 -0.513787 -0.129473 -0.159730 0.352665 -0.121648 -0.111295 0.339216 -0.328136 -0.311016 -0.172161 0.060363 -0.151756 -0.234441 -0.103378 -0.056019 -0.089295 -0.147774 -0.068579 -0.056302 0.482015 -0.310736 -0.302085 -0.186574 0.099625 0.095664 0.093479 0.116533 0.109090 0.102865 0.100890 0.106599 0.152904 0.159462 0.147992 0.098390 0.091570 0.111582 0.029204 0.083370 0.069266 0.084347 0.064738 0.069769 0.015209 0.029993 0.075988 0.095952 0.079443 0.098083 0.077500 0.086197 0.092738 0.104814 0.130724 0.108464
qa: 0.0108 -0.3694 -0.3039 -0.5138 -0.1295 -0.1597 0.3527 -0.1216 -0.1113 0.3392 -0.3281 -0.3110 -0.1722 0.0604 -0.1518 -0.2344 -0.1034 -0.0560 -0.0893 -0.1478 -0.0686 -0.0563 0.4820 -0.3107 -0.3021 -0.1866 0.0996 0.0957 0.0935 0.1165 0.1091 0.1029 0.1009 0.1066 0.1529 0.1595 0.1480 0.0984 0.0916 0.1116 0.0292 0.0834 0.0693 0.0843 0.0647 0.0698 0.0152 0.0300 0.0760 0.0960 0.0794 0.0981 0.0775 0.0862 0.0927 0.1048 0.1307 0.1085
va: 2.3589 2.0569 2.0660 1.9953 3.0389 3.1434 3.7156 4.0225 3.6925 3.8014 3.9663 3.9590 3.9413 3.7020 3.8477 3.9641 3.9319 3.9010 3.7597 3.8715 3.8444 3.8550 4.2684 3.9507 3.9582 3.8842 1.0047 1.0072 1.0044 1.0078 0.9956 1.0010 1.0048 1.0026 0.9952 0.9877 1.0018 0.9973 1.0099 0.9964 1.0085 1.0119 1.0064 1.0146 1.0264 1.0074 1.0159 1.0102 1.0066 0.9994 0.9953 1.0041 1.0011 1.0007 1.0033 1.0091 0.9966 0.9887
dispcorr: -0.037902252 hartree
energy: -1514.947954398161
dipole: -9.03629 8.72946 -0.30683 -13.59402 12.57649 -1.01752 -23.39200 21.13672 -2.25528
magnitude: 2.49315 au
magnitude: 6.33707 debye
