program: Orca
programVersion: 5.0.2
elementType: S O O O N N C C C C C C C C C C C C C C C C C C C C H H H H H H H H H H H H H H H H H H H H H H H H H H H H H H H H
charge: 0
multiplicity: 1
keywords: wb97x-d3
keywords: def2-TZVPP
keywords: def2/J RIJCOSX
keywords: DEFGRID2
keywords: scfconv7
keywords: smallprint printgap noloewdin
keywords: NOSOSCF
formula: C20H32N2O3S
InChI: InChI=1/C20H32N2O3S/c1-6-8-13-22(14-9-7-2)26-21(5)19(23)24-17-12-10-11-16-15-20(3,4)25-18(16)17/h10-12H,6-9,13-15H2,1-5H3
58 atoms
S  -1.892915 1.903619 0.944566
O  1.439287 -1.412967 0.042097
O  0.793345 1.085169 1.296143
O  0.426422 -0.608074 2.729295
N  -2.386981 1.177021 -0.467905
N  -1.300125 0.681389 2.007585
C  2.132562 -2.647929 -0.330538
C  3.596094 -2.21525 -0.5692
C  3.663836 -0.899237 0.144889
C  2.362915 -0.523799 0.438516
C  1.452309 -3.194804 -1.565095
C  2.021846 -3.595366 0.850884
C  4.719209 -0.072155 0.479253
C  2.088996 0.673191 1.07568
C  4.44985 1.136682 1.117663
C  3.144017 1.50583 1.417086
C  -3.597423 0.352691 -0.412864
C  -1.345995 0.63642 -1.343039
C  -4.484819 0.526935 -1.637309
C  -0.361964 1.674478 -1.85249
C  -5.695763 -0.39658 -1.596797
C  0.732846 1.043117 -2.704802
C  0.003031 0.305517 2.056118
C  -6.627365 -0.188559 -2.780801
C  1.837866 2.026664 -3.055407
C  -2.24333 -0.103529 2.795664
H  3.809976 -2.091673 -1.634647
H  4.298687 -2.9533 -0.180833
H  0.403822 -3.425756 -1.371647
H  1.943747 -4.115867 -1.878785
H  1.505445 -2.487069 -2.393424
H  2.518766 -4.538168 0.620693
H  0.979322 -3.813759 1.085687
H  2.496113 -3.179335 1.74201
H  5.738138 -0.354043 0.247037
H  5.261815 1.797068 1.389615
H  2.939333 2.446182 1.912971
H  -4.165505 0.637401 0.473489
H  -3.329707 -0.704616 -0.287682
H  -1.848685 0.182555 -2.199077
H  -0.812478 -0.181906 -0.844809
H  -4.817464 1.567528 -1.689766
H  -3.920446 0.33366 -2.554238
H  -0.897776 2.426462 -2.43885
H  0.095552 2.203891 -1.01419
H  -6.247465 -0.23554 -0.665868
H  -5.358495 -1.436907 -1.574889
H  1.166182 0.19176 -2.172663
H  0.295599 0.63472 -3.620483
H  -7.488258 -0.856429 -2.733718
H  -6.115877 -0.377731 -3.726392
H  -7.006587 0.834421 -2.811849
H  2.604155 1.562122 -3.677034
H  2.327974 2.40116 -2.15428
H  1.449432 2.887857 -3.602068
H  -3.199521 0.410677 2.802597
H  -1.907375 -0.200655 3.8269
H  -2.390341 -1.099429 2.376897
elementType: S O N C H
totalener: -1514.91337253 hartree
nucrepener: 2773.47890830 hartree
electener: -4288.39228083 hartree
oneelecener: -7586.26931354 hartree
twoeener: 3297.87703270 hartree
cpcmener: -0.03198693 hartree
kineticenergy: 1509.10325420 hartree
xcener: -129.013820486923 hartree
chargesum: 0.0000000
charge: 0.015984 -0.372186 -0.310045 -0.509325 -0.128696 -0.163990 0.365479 -0.123807 -0.078684 0.293005 -0.307949 -0.331640 -0.179398 0.064906 -0.156704 -0.219760 -0.094267 -0.148309 -0.105928 -0.117099 -0.082711 -0.062862 0.490672 -0.283138 -0.289987 -0.177323 0.091603 0.102120 0.102067 0.110915 0.101044 0.104535 0.100447 0.109618 0.151883 0.159636 0.150251 0.096726 0.096881 0.120318 0.089983 0.056224 0.066602 0.081338 0.060958 0.059349 0.059641 0.017243 0.078974 0.090973 0.079505 0.079037 0.092025 0.074904 0.085995 0.103706 0.116265 0.122994
qa: 0.0160 -0.3722 -0.3100 -0.5093 -0.1287 -0.1640 0.3655 -0.1238 -0.0787 0.2930 -0.3079 -0.3316 -0.1794 0.0649 -0.1567 -0.2198 -0.0943 -0.1483 -0.1059 -0.1171 -0.0827 -0.0629 0.4907 -0.2831 -0.2900 -0.1773 0.0916 0.1021 0.1021 0.1109 0.1010 0.1045 0.1004 0.1096 0.1519 0.1596 0.1503 0.0967 0.0969 0.1203 0.0900 0.0562 0.0666 0.0813 0.0610 0.0593 0.0596 0.0172 0.0790 0.0910 0.0795 0.0790 0.0920 0.0749 0.0860 0.1037 0.1163 0.1230
va: 2.3268 2.0370 2.0765 1.9963 3.0130 3.1713 3.7244 4.0078 3.6691 3.7903 3.9300 3.9753 3.9527 3.7579 3.8689 3.9796 3.9115 3.9218 3.8714 3.8283 3.8773 3.8734 4.2569 3.9511 3.9572 3.8808 1.0094 1.0039 1.0059 1.0037 0.9987 1.0064 1.0089 0.9979 0.9962 0.9879 0.9995 1.0071 0.9939 0.9901 1.0205 1.0201 1.0169 1.0182 1.0270 1.0063 1.0079 1.0225 1.0075 1.0037 1.0006 0.9999 1.0035 1.0001 1.0010 1.0098 1.0006 0.9870
dispcorr: -0.032955270 hartree
energy: -1514.946327802444
dipole: -18.74922 18.50887 -0.24034 -11.90278 10.63164 -1.27114 -26.78794 25.18332 -1.60462
magnitude: 2.06115 au
magnitude: 5.23904 debye
