program: Orca
programVersion: 5.0.2
elementType: S O O O N N C C C C C C C C C C C C C C C C C C C C H H H H H H H H H H H H H H H H H H H H H H H H H H H H H H H H
charge: 0
multiplicity: 1
keywords: wb97x-d3
keywords: def2-TZVPP
keywords: def2/J RIJCOSX
keywords: DEFGRID2
keywords: scfconv7
keywords: smallprint printgap noloewdin
keywords: NOSOSCF
formula: C20H32N2O3S
InChI: InChI=1/C20H32N2O3S/c1-6-8-13-22(14-9-7-2)26-21(5)19(23)24-17-12-10-11-16-15-20(3,4)25-18(16)17/h10-12H,6-9,13-15H2,1-5H3
58 atoms
S  -2.234411 0.009488 -0.69005
O  2.027678 -1.715777 -0.725154
O  0.51326 0.583372 -0.623207
O  0.511945 2.413297 -1.937173
N  -2.657342 0.492994 0.843908
N  -1.42019 1.315116 -1.472441
C  3.123924 -2.681786 -0.826623
C  4.294417 -2.040835 -0.045713
C  3.871778 -0.608413 0.0585
C  2.547039 -0.536711 -0.339345
C  3.457986 -2.830371 -2.300173
C  2.643344 -3.982382 -0.221693
C  4.526102 0.523962 0.502623
C  1.845136 0.655001 -0.298254
C  3.821682 1.724586 0.560304
C  2.48807 1.792609 0.176288
C  -3.698369 1.515557 0.963737
C  -1.577182 0.639817 1.821796
C  -4.970795 1.222908 0.188883
C  -0.794995 -0.637283 2.078455
C  -5.635137 -0.103059 0.535125
C  0.404488 -0.387213 2.98378
C  -0.080296 1.514403 -1.381669
C  -6.969294 -0.276225 -0.174331
C  1.22979 -1.642824 3.216957
C  -2.18342 2.301922 -2.228473
H  5.242747 -2.174818 -0.567558
H  4.406223 -2.484656 0.947715
H  4.263942 -3.553375 -2.429246
H  3.788544 -1.883808 -2.732339
H  2.59561 -3.184649 -2.866553
H  3.442401 -4.72323 -0.258286
H  1.790113 -4.386258 -0.768371
H  2.357001 -3.851363 0.822905
H  5.561822 0.480188 0.813848
H  4.310789 2.620446 0.91792
H  1.954616 2.729018 0.262036
H  -3.31197 2.503338 0.68046
H  -3.947687 1.577957 2.025955
H  -2.045377 0.9533 2.757668
H  -0.899479 1.456123 1.5401
H  -5.661503 2.041442 0.413348
H  -4.791381 1.273322 -0.888193
H  -1.455922 -1.378268 2.537402
H  -0.44811 -1.072903 1.139465
H  -5.782122 -0.164677 1.617848
H  -4.975928 -0.932863 0.270195
H  1.039099 0.385756 2.539785
H  0.065563 0.013532 3.943799
H  -6.847435 -0.242304 -1.258799
H  -7.67194 0.512593 0.100836
H  -7.434313 -1.231502 0.072698
H  0.636145 -2.427626 3.689552
H  2.086341 -1.444667 3.862493
H  1.614458 -2.045064 2.27689
H  -1.756967 2.45563 -3.219763
H  -2.227506 3.260925 -1.709775
H  -3.196998 1.932571 -2.355755
elementType: S O N C H
totalener: -1514.91043203 hartree
nucrepener: 2757.86430831 hartree
electener: -4272.77474035 hartree
oneelecener: -7554.88628581 hartree
twoeener: 3282.11154546 hartree
cpcmener: -0.03270947 hartree
kineticenergy: 1509.09474728 hartree
xcener: -129.015813094507 hartree
chargesum: -0.0000000
charge: 0.015756 -0.377917 -0.291473 -0.515035 -0.125538 -0.162464 0.357717 -0.106864 -0.066339 0.253748 -0.313942 -0.301439 -0.201641 0.051465 -0.150734 -0.205272 -0.131134 -0.139660 -0.127189 -0.096667 -0.067899 -0.104330 0.503886 -0.283443 -0.268139 -0.183182 0.103003 0.094637 0.100519 0.108302 0.099003 0.105819 0.100605 0.105046 0.152596 0.160237 0.141406 0.112304 0.105405 0.106966 0.091598 0.077429 0.068880 0.081118 0.053743 0.061085 0.049410 0.059782 0.078554 0.079056 0.079039 0.090956 0.089259 0.094042 0.041364 0.116595 0.120752 0.109217
qa: 0.0158 -0.3779 -0.2915 -0.5150 -0.1255 -0.1625 0.3577 -0.1069 -0.0663 0.2537 -0.3139 -0.3014 -0.2016 0.0515 -0.1507 -0.2053 -0.1311 -0.1397 -0.1272 -0.0967 -0.0679 -0.1043 0.5039 -0.2834 -0.2681 -0.1832 0.1030 0.0946 0.1005 0.1083 0.0990 0.1058 0.1006 0.1050 0.1526 0.1602 0.1414 0.1123 0.1054 0.1070 0.0916 0.0774 0.0689 0.0811 0.0537 0.0611 0.0494 0.0598 0.0786 0.0791 0.0790 0.0910 0.0893 0.0940 0.0414 0.1166 0.1208 0.1092
va: 2.3384 2.0506 2.0859 1.9950 3.0187 3.1814 3.7220 3.9651 3.6213 3.7985 3.9742 3.9442 3.9628 3.8268 3.8826 3.9577 3.9182 3.9050 3.8617 3.7955 3.8454 3.8815 4.2528 3.9494 3.9484 3.8855 1.0064 1.0085 1.0042 0.9976 1.0086 1.0028 1.0068 0.9927 0.9982 0.9884 1.0148 0.9930 0.9986 1.0008 0.9974 1.0145 1.0135 1.0176 1.0387 1.0101 1.0217 1.0020 1.0084 1.0001 1.0009 1.0036 1.0039 1.0044 1.0089 1.0006 0.9883 1.0032
dispcorr: -0.033025874 hartree
energy: -1514.943457908077
dipole: -16.36969 16.39238 0.02270 -11.12442 10.52222 -0.60220 13.73554 -12.42730 1.30825
magnitude: 1.44037 au
magnitude: 3.66114 debye
