program: Orca
programVersion: 5.0.2
elementType: S O O O N N C C C C C C C C C C C C C C C C C C C C H H H H H H H H H H H H H H H H H H H H H H H H H H H H H H H H
charge: 0
multiplicity: 1
keywords: wb97x-d3
keywords: def2-TZVPP
keywords: def2/J RIJCOSX
keywords: DEFGRID2
keywords: scfconv7
keywords: smallprint printgap noloewdin
keywords: NOSOSCF
formula: C20H32N2O3S
InChI: InChI=1/C20H32N2O3S/c1-6-8-13-22(14-9-7-2)26-21(5)19(23)24-17-12-10-11-16-15-20(3,4)25-18(16)17/h10-12H,6-9,13-15H2,1-5H3
58 atoms
S  -0.467255 2.588072 0.196108
O  0.828914 -2.415294 0.667161
O  1.211964 0.424582 0.926014
O  1.930149 -0.13042 -1.132266
N  -2.040624 2.118383 0.150763
N  0.477259 1.590418 -0.857177
C  1.089594 -3.849318 0.531324
C  2.173186 -4.153983 1.591959
C  2.702145 -2.791134 1.919779
C  1.84808 -1.863978 1.342215
C  1.60502 -4.073918 -0.878678
C  -0.214711 -4.573387 0.778982
C  3.787515 -2.370622 2.663892
C  2.072095 -0.505781 1.476561
C  4.009226 -1.003449 2.817462
C  3.160187 -0.078169 2.22336
C  -2.511356 0.978872 0.937663
C  -2.927145 2.548138 -0.926948
C  -3.010847 -0.217561 0.135195
C  -2.783663 4.003269 -1.336434
C  -1.999305 -0.824769 -0.824384
C  -3.852152 4.391121 -2.352592
C  1.247248 0.568873 -0.414669
C  -2.531097 -2.06784 -1.519985
C  -3.71961 5.831981 -2.819679
C  0.441958 1.816288 -2.296384
H  2.937544 -4.825895 1.199401
H  1.745614 -4.632478 2.477281
H  0.871537 -3.754517 -1.620948
H  1.804863 -5.133786 -1.038792
H  2.534485 -3.529448 -1.056692
H  -0.062933 -5.649219 0.689072
H  -0.97541 -4.282004 0.052442
H  -0.595834 -4.371853 1.780785
H  4.455315 -3.088938 3.122075
H  4.853402 -0.65349 3.395869
H  3.33984 0.983461 2.336957
H  -3.32777 1.322126 1.582112
H  -1.700799 0.670765 1.598281
H  -3.946837 2.395135 -0.561984
H  -2.817058 1.90739 -1.810218
H  -3.319711 -0.973968 0.863993
H  -3.920411 0.051204 -0.410319
H  -2.865151 4.643356 -0.453004
H  -1.79561 4.18707 -1.765846
H  -1.091431 -1.081593 -0.278121
H  -1.710437 -0.088065 -1.578123
H  -3.793734 3.720893 -3.215441
H  -4.843266 4.238252 -1.915525
H  -3.419599 -1.842257 -2.113238
H  -2.806567 -2.83949 -0.798238
H  -1.786855 -2.497748 -2.192134
H  -2.754251 6.006521 -3.29842
H  -3.802729 6.529604 -1.984237
H  -4.4957 6.090355 -3.54118
H  -0.122709 2.723628 -2.490011
H  -0.042378 0.993394 -2.822847
H  1.443885 1.952865 -2.702662
elementType: S O N C H
totalener: -1514.90964201 hartree
nucrepener: 2744.17026331 hartree
electener: -4259.07990532 hartree
oneelecener: -7527.96297253 hartree
twoeener: 3268.88306720 hartree
cpcmener: -0.03359315 hartree
kineticenergy: 1509.09471413 hartree
xcener: -129.019180145451 hartree
chargesum: -0.0000000
charge: 0.009937 -0.364809 -0.319293 -0.519196 -0.127413 -0.140786 0.360421 -0.107338 -0.082933 0.255565 -0.330048 -0.305407 -0.203272 0.084691 -0.157200 -0.198809 -0.104327 -0.109150 -0.093102 -0.105778 -0.068327 -0.073685 0.490834 -0.318022 -0.291294 -0.187388 0.099475 0.092193 0.100407 0.105396 0.109062 0.108109 0.099900 0.100187 0.153401 0.159842 0.149719 0.099304 0.090990 0.099039 0.089386 0.082203 0.074892 0.070648 0.053407 0.021386 0.053116 0.059022 0.060509 0.096128 0.084152 0.096612 0.080022 0.079408 0.090929 0.110444 0.118125 0.118719
qa: 0.0099 -0.3648 -0.3193 -0.5192 -0.1274 -0.1408 0.3604 -0.1073 -0.0829 0.2556 -0.3300 -0.3054 -0.2033 0.0847 -0.1572 -0.1988 -0.1043 -0.1091 -0.0931 -0.1058 -0.0683 -0.0737 0.4908 -0.3180 -0.2913 -0.1874 0.0995 0.0922 0.1004 0.1054 0.1091 0.1081 0.0999 0.1002 0.1534 0.1598 0.1497 0.0993 0.0910 0.0990 0.0894 0.0822 0.0749 0.0706 0.0534 0.0214 0.0531 0.0590 0.0605 0.0961 0.0842 0.0966 0.0800 0.0794 0.0909 0.1104 0.1181 0.1187
va: 2.3728 2.0798 2.0893 1.9800 3.0125 3.1822 3.6848 3.9932 3.6521 3.9289 3.9901 3.9476 3.9601 3.8272 3.8666 3.9993 3.9291 3.9062 3.7731 3.8797 3.8560 3.8725 4.2047 3.9530 3.9540 3.8986 1.0048 1.0094 1.0049 1.0059 0.9987 1.0036 1.0000 1.0051 0.9968 0.9883 0.9988 0.9983 1.0128 0.9932 0.9777 1.0128 1.0063 1.0162 1.0222 1.0431 1.0068 1.0078 1.0081 1.0048 0.9970 1.0019 0.9998 0.9995 1.0038 0.9966 0.9890 1.0002
dispcorr: -0.033036465 hartree
energy: -1514.942678473939
dipole: -30.08097 28.64914 -1.43183 -0.96099 0.11020 -0.85079 -19.11796 19.16726 0.04930
magnitude: 1.66626 au
magnitude: 4.23530 debye
