program: Orca
programVersion: 5.0.2
elementType: S O O O N N C C C C C C C C C C C C C C C C C C C C H H H H H H H H H H H H H H H H H H H H H H H H H H H H H H H H
charge: 0
multiplicity: 1
keywords: wb97x-d3
keywords: def2-TZVPP
keywords: def2/J RIJCOSX
keywords: DEFGRID2
keywords: scfconv7
keywords: smallprint printgap noloewdin
keywords: NOSOSCF
formula: C20H32N2O3S
InChI: InChI=1/C20H32N2O3S/c1-6-8-13-22(14-9-7-2)26-21(5)19(23)24-17-12-10-11-16-15-20(3,4)25-18(16)17/h10-12H,6-9,13-15H2,1-5H3
58 atoms
S  -1.763753 2.294486 1.176096
O  0.839651 -1.502779 0.353027
O  0.758588 1.053126 1.634295
O  0.079459 -0.509518 3.101734
N  -1.865398 1.716892 -0.364678
N  -1.392464 1.012408 2.282516
C  1.260279 -2.608482 -0.512698
C  2.768821 -2.783927 -0.221316
C  3.124654 -1.492985 0.451123
C  1.939243 -0.843541 0.75284
C  1.018175 -2.179833 -1.949249
C  0.431609 -3.816717 -0.135146
C  4.336389 -0.928874 0.803733
C  1.9368 0.374811 1.410408
C  4.340828 0.299124 1.461989
C  3.148577 0.943635 1.770761
C  -2.961783 0.823855 -0.726572
C  -0.647184 1.620548 -1.169915
C  -2.701593 -0.656837 -0.463055
C  -0.839995 2.07963 -2.608056
C  -3.769977 -1.560774 -1.072271
C  0.470334 2.018355 -3.384317
C  -0.171965 0.439742 2.392033
C  -3.699427 -1.65223 -2.590692
C  0.33753 2.561005 -4.798625
C  -2.469027 0.40986 3.059614
H  3.333842 -2.961549 -1.137226
H  2.953892 -3.632884 0.442607
H  -0.036809 -1.962228 -2.126105
H  1.312631 -2.979801 -2.629377
H  1.601405 -1.293223 -2.207144
H  -0.63262 -3.636627 -0.296922
H  0.583495 -4.090658 0.909482
H  0.72209 -4.669095 -0.749451
H  5.267737 -1.428597 0.570243
H  5.278776 0.758446 1.742761
H  3.156648 1.898635 2.280584
H  -3.182449 0.98072 -1.784587
H  -3.851049 1.145629 -0.1809
H  -0.244924 0.602146 -1.165373
H  0.105009 2.256888 -0.70532
H  -1.728159 -0.946343 -0.867701
H  -2.652264 -0.830702 0.613557
H  -1.583413 1.46297 -3.121253
H  -1.222382 3.104672 -2.611694
H  -4.763024 -1.217033 -0.766721
H  -3.656307 -2.563664 -0.65373
H  1.238743 2.58365 -2.848501
H  0.823539 0.982941 -3.418065
H  -3.874091 -0.689879 -3.073889
H  -4.445088 -2.347196 -2.978972
H  -2.71891 -2.008752 -2.914018
H  1.279335 2.490771 -5.344007
H  0.038902 3.61087 -4.791752
H  -0.413727 2.010156 -5.367526
H  -3.398115 0.912415 2.809078
H  -2.297176 0.529504 4.12931
H  -2.585097 -0.651548 2.840991
elementType: S O N C H
totalener: -1514.90992990 hartree
nucrepener: 2821.18441320 hartree
electener: -4336.09434309 hartree
oneelecener: -7681.29257258 hartree
twoeener: 3345.19822948 hartree
cpcmener: -0.03375355 hartree
kineticenergy: 1509.08490858 hartree
xcener: -129.015663876183 hartree
chargesum: -0.0000000
charge: 0.007201 -0.376371 -0.318430 -0.509436 -0.123513 -0.164512 0.376557 -0.110499 -0.119262 0.327510 -0.352223 -0.309178 -0.187749 0.082493 -0.156153 -0.217740 -0.157798 -0.036774 -0.021031 -0.105940 -0.116410 -0.075009 0.483816 -0.269060 -0.287830 -0.179965 0.099784 0.093120 0.104127 0.119579 0.108741 0.099781 0.099493 0.105121 0.153251 0.159834 0.151102 0.108454 0.101500 0.018703 0.094236 -0.011912 0.091367 0.069755 0.061265 0.062096 0.071721 0.061388 0.054383 0.076753 0.095026 0.076622 0.091374 0.080762 0.079156 0.104365 0.125875 0.110483
qa: 0.0072 -0.3764 -0.3184 -0.5094 -0.1235 -0.1645 0.3766 -0.1105 -0.1193 0.3275 -0.3522 -0.3092 -0.1877 0.0825 -0.1562 -0.2177 -0.1578 -0.0368 -0.0210 -0.1059 -0.1164 -0.0750 0.4838 -0.2691 -0.2878 -0.1800 0.0998 0.0931 0.1041 0.1196 0.1087 0.0998 0.0995 0.1051 0.1533 0.1598 0.1511 0.1085 0.1015 0.0187 0.0942 -0.0119 0.0914 0.0698 0.0613 0.0621 0.0717 0.0614 0.0544 0.0768 0.0950 0.0766 0.0914 0.0808 0.0792 0.1044 0.1259 0.1105
va: 2.3421 2.0600 2.0786 1.9983 3.0606 3.1460 3.6841 3.9996 3.6931 3.8311 3.9736 3.9579 3.9445 3.7593 3.8692 3.9983 3.9605 3.9427 3.7676 3.8566 3.9298 3.8791 4.2733 3.9319 3.9563 3.8784 1.0043 1.0083 0.9901 1.0076 0.9942 0.9999 1.0057 1.0022 0.9965 0.9882 0.9994 0.9860 1.0151 1.0154 1.0191 1.0485 1.0100 1.0084 1.0203 1.0080 1.0043 1.0062 1.0081 1.0021 1.0058 1.0002 1.0034 1.0000 1.0002 1.0131 0.9955 0.9895
dispcorr: -0.034742674 hartree
energy: -1514.944672573559
dipole: -14.82541 14.69685 -0.12856 -11.88656 10.86321 -1.02335 -34.72997 32.48374 -2.24623
magnitude: 2.47170 au
magnitude: 6.28257 debye
