program: Orca
programVersion: 5.0.2
elementType: S O O O N N C C C C C C C C C C C C C C C C C C C C H H H H H H H H H H H H H H H H H H H H H H H H H H H H H H H H
charge: 0
multiplicity: 1
keywords: wb97x-d3
keywords: def2-TZVPP
keywords: def2/J RIJCOSX
keywords: DEFGRID2
keywords: scfconv7
keywords: smallprint printgap noloewdin
keywords: NOSOSCF
formula: C20H32N2O3S
InChI: InChI=1/C20H32N2O3S/c1-6-8-13-22(14-9-7-2)26-21(5)19(23)24-17-12-10-11-16-15-20(3,4)25-18(16)17/h10-12H,6-9,13-15H2,1-5H3
58 atoms
S  -1.899656 2.253891 0.782441
O  0.94988 -1.440505 0.039743
O  0.648236 1.131993 1.239132
O  0.070713 -0.397814 2.781241
N  -2.209249 1.654478 -0.728956
N  -1.50127 0.961579 1.860973
C  1.454397 -2.668958 -0.580557
C  2.997845 -2.520427 -0.597552
C  3.226676 -1.214841 0.098719
C  1.989181 -0.680524 0.412142
C  0.864164 -2.741412 -1.974399
C  1.000934 -3.823303 0.290911
C  4.382615 -0.521688 0.408245
C  1.879027 0.551169 1.035901
C  4.278744 0.715906 1.038577
C  3.033779 1.248785 1.352795
C  -3.453013 0.923395 -0.955334
C  -1.091597 1.227375 -1.571169
C  -3.383126 -0.584141 -0.746627
C  -0.03356 2.293286 -1.791054
C  -4.728497 -1.249332 -1.004742
C  1.152531 1.747907 -2.577316
C  -0.240638 0.490294 2.018345
C  -4.662689 -2.763059 -0.87585
C  2.275952 2.763928 -2.708831
C  -2.542854 0.348869 2.676788
H  3.386207 -2.504186 -1.618321
H  3.483728 -3.352576 -0.084705
H  -0.226252 -2.777169 -1.944373
H  1.214798 -3.642298 -2.478641
H  1.166152 -1.882472 -2.576366
H  -0.087091 -3.866001 0.358642
H  1.408192 -3.740256 1.299806
H  1.346932 -4.766827 -0.131799
H  5.353819 -0.929169 0.158528
H  5.171554 1.272636 1.288234
H  2.954872 2.214928 1.834773
H  -3.765103 1.121981 -1.985882
H  -4.218815 1.356189 -0.308847
H  -1.522433 0.955221 -2.538513
H  -0.628618 0.315004 -1.182663
H  -2.634133 -1.01898 -1.415888
H  -3.057224 -0.811851 0.271226
H  -0.473089 3.141454 -2.323922
H  0.321423 2.679605 -0.833956
H  -5.081145 -0.983066 -2.005733
H  -5.470367 -0.852214 -0.305617
H  1.534356 0.849495 -2.081616
H  0.822735 1.429402 -3.570506
H  -5.636802 -3.222579 -1.04749
H  -4.327895 -3.061822 0.119218
H  -3.96537 -3.191056 -1.598407
H  2.662343 3.047996 -1.727697
H  1.934886 3.674412 -3.204997
H  3.110592 2.367215 -3.287969
H  -2.411851 0.585528 3.732662
H  -2.55932 -0.733659 2.560503
H  -3.505114 0.737975 2.360627
elementType: S O N C H
totalener: -1514.91260644 hartree
nucrepener: 2832.83875002 hartree
electener: -4347.75135646 hartree
oneelecener: -7704.84082051 hartree
twoeener: 3357.08946405 hartree
cpcmener: -0.03256585 hartree
kineticenergy: 1509.10594370 hartree
xcener: -129.017446029321 hartree
chargesum: -0.0000000
charge: 0.015177 -0.366556 -0.308238 -0.510725 -0.135729 -0.168854 0.363140 -0.148717 -0.090182 0.353480 -0.317189 -0.316324 -0.161655 0.018992 -0.163091 -0.219668 -0.100488 -0.081320 -0.100958 -0.144539 -0.087243 -0.058839 0.490365 -0.273742 -0.300421 -0.192416 0.097713 0.099288 0.098371 0.115648 0.103195 0.098961 0.105184 0.103267 0.153076 0.159584 0.148721 0.093174 0.095704 0.111996 0.051030 0.070146 0.069305 0.082486 0.064294 0.058807 0.060973 0.031833 0.076406 0.092214 0.078786 0.078122 0.076825 0.085711 0.092536 0.130818 0.112580 0.108982
qa: 0.0152 -0.3666 -0.3082 -0.5107 -0.1357 -0.1689 0.3631 -0.1487 -0.0902 0.3535 -0.3172 -0.3163 -0.1617 0.0190 -0.1631 -0.2197 -0.1005 -0.0813 -0.1010 -0.1445 -0.0872 -0.0588 0.4904 -0.2737 -0.3004 -0.1924 0.0977 0.0993 0.0984 0.1156 0.1032 0.0990 0.1052 0.1033 0.1531 0.1596 0.1487 0.0932 0.0957 0.1120 0.0510 0.0701 0.0693 0.0825 0.0643 0.0588 0.0610 0.0318 0.0764 0.0922 0.0788 0.0781 0.0768 0.0857 0.0925 0.1308 0.1126 0.1090
va: 2.3392 2.0470 2.0690 1.9990 3.0387 3.1469 3.7101 4.0707 3.6956 3.7773 3.9532 3.9710 3.9378 3.7221 3.8635 3.9626 3.9220 3.9116 3.7970 3.8722 3.8939 3.8628 4.2659 3.9394 3.9580 3.8831 1.0058 1.0042 1.0054 1.0049 0.9981 1.0069 0.9999 1.0037 0.9945 0.9877 1.0006 1.0002 1.0116 0.9946 1.0117 1.0152 1.0029 1.0161 1.0267 1.0094 1.0069 1.0090 1.0069 1.0043 1.0007 1.0016 1.0009 1.0007 1.0034 0.9970 0.9893 1.0063
dispcorr: -0.034811574 hartree
energy: -1514.947418015700
dipole: -12.86352 12.61509 -0.24843 -15.02732 13.84677 -1.18056 -23.41704 21.36426 -2.05278
magnitude: 2.38103 au
magnitude: 6.05211 debye
