program: Orca
programVersion: 5.0.2
elementType: S O O O N N C C C C C C C C C C C C C C C C C C C C H H H H H H H H H H H H H H H H H H H H H H H H H H H H H H H H
charge: 0
multiplicity: 1
keywords: wb97x-d3
keywords: def2-TZVPP
keywords: def2/J RIJCOSX
keywords: DEFGRID2
keywords: scfconv7
keywords: smallprint printgap noloewdin
keywords: NOSOSCF
formula: C20H32N2O3S
InChI: InChI=1/C20H32N2O3S/c1-6-8-13-22(14-9-7-2)26-21(5)19(23)24-17-12-10-11-16-15-20(3,4)25-18(16)17/h10-12H,6-9,13-15H2,1-5H3
58 atoms
S  -2.045414 2.155898 1.279223
O  1.11745 -1.395565 -0.091777
O  0.581887 1.057196 1.305038
O  0.165748 -0.72247 2.618997
N  -2.188349 2.054933 -0.351856
N  -1.523299 0.647116 1.96334
C  1.762307 -2.643987 -0.506385
C  3.232155 -2.248322 -0.764698
C  3.360799 -0.972166 0.011018
C  2.078016 -0.561467 0.338357
C  1.04011 -3.146596 -1.736283
C  1.644041 -3.611391 0.658397
C  4.451265 -0.204152 0.373079
C  1.857927 0.610564 1.041968
C  4.235818 0.980644 1.074131
C  2.949136 1.383855 1.409717
C  -3.341142 1.403132 -0.957758
C  -1.063828 2.401629 -1.215244
C  -3.337338 -0.120699 -0.926972
C  -0.391924 1.252043 -1.953908
C  -4.5058 -0.707406 -1.708904
C  0.913042 1.699595 -2.601842
C  -0.231584 0.249257 2.013252
C  -4.519788 -2.228157 -1.680008
C  1.606309 0.58119 -3.363654
C  -2.496067 -0.193401 2.650946
H  3.420094 -2.07601 -1.828716
H  3.919754 -3.027747 -0.434942
H  1.496678 -4.075771 -2.077648
H  1.096437 -2.426095 -2.553013
H  -0.011008 -3.350289 -1.525709
H  0.599037 -3.792126 0.913641
H  2.154831 -3.232837 1.546106
H  2.096716 -4.568547 0.398449
H  5.456265 -0.513483 0.116368
H  5.076269 1.594382 1.368276
H  2.787647 2.303912 1.957025
H  -3.392748 1.747184 -1.995094
H  -4.24642 1.769972 -0.466447
H  -0.330063 2.921914 -0.599089
H  -1.418452 3.131313 -1.951197
H  -2.398343 -0.503666 -1.334492
H  -3.391982 -0.468007 0.108134
H  -0.195934 0.428298 -1.267714
H  -1.062443 0.858835 -2.724382
H  -4.45754 -0.362352 -2.74619
H  -5.446889 -0.32395 -1.30335
H  0.718134 2.538076 -3.277198
H  1.585596 2.082349 -1.82751
H  -3.6015 -2.639545 -2.103572
H  -5.355368 -2.632751 -2.252386
H  -4.607606 -2.604968 -0.659303
H  2.521358 0.930874 -3.843221
H  0.96202 0.17058 -4.143458
H  1.880708 -0.239399 -2.698785
H  -3.484799 0.227881 2.499626
H  -2.305524 -0.230406 3.723577
H  -2.493442 -1.209984 2.258622
elementType: S O N C H
totalener: -1514.90979554 hartree
nucrepener: 2841.44063545 hartree
electener: -4356.35043099 hartree
oneelecener: -7722.30016054 hartree
twoeener: 3365.94972955 hartree
cpcmener: -0.03185463 hartree
kineticenergy: 1509.09366539 hartree
xcener: -129.019256445329 hartree
chargesum: 0.0000000
charge: 0.010310 -0.376901 -0.316710 -0.514558 -0.148614 -0.165235 0.364320 -0.120314 -0.111523 0.316960 -0.304962 -0.337528 -0.181010 0.078768 -0.153730 -0.233489 -0.104716 -0.093958 -0.102970 -0.075966 -0.084816 -0.108784 0.495197 -0.275095 -0.251272 -0.188731 0.095255 0.106460 0.108895 0.103435 0.102117 0.100974 0.109647 0.104979 0.151679 0.159998 0.148599 0.095621 0.104371 0.082673 0.099323 0.070741 0.063081 0.021305 0.088232 0.061645 0.058463 0.073158 0.063271 0.077790 0.092087 0.079137 0.098594 0.088485 0.028715 0.100923 0.128394 0.117277
qa: 0.0103 -0.3769 -0.3167 -0.5146 -0.1486 -0.1652 0.3643 -0.1203 -0.1115 0.3170 -0.3050 -0.3375 -0.1810 0.0788 -0.1537 -0.2335 -0.1047 -0.0940 -0.1030 -0.0760 -0.0848 -0.1088 0.4952 -0.2751 -0.2513 -0.1887 0.0953 0.1065 0.1089 0.1034 0.1021 0.1010 0.1096 0.1050 0.1517 0.1600 0.1486 0.0956 0.1044 0.0827 0.0993 0.0707 0.0631 0.0213 0.0882 0.0616 0.0585 0.0732 0.0633 0.0778 0.0921 0.0791 0.0986 0.0885 0.0287 0.1009 0.1284 0.1173
va: 2.3640 2.0320 2.0770 1.9923 3.0525 3.1479 3.7305 3.9840 3.6691 3.7716 3.9251 3.9716 3.9507 3.7632 3.8642 3.9861 3.9172 3.9011 3.8167 3.7255 3.9005 3.8778 4.2520 3.9436 3.9317 3.8777 1.0050 1.0043 1.0037 0.9978 1.0060 1.0089 0.9985 1.0069 0.9965 0.9878 1.0011 0.9994 1.0073 1.0182 0.9991 1.0089 1.0110 1.0393 1.0086 1.0087 1.0085 1.0104 1.0042 1.0009 1.0043 1.0011 1.0081 1.0035 1.0115 1.0128 0.9973 0.9865
dispcorr: -0.035680641 hartree
energy: -1514.945476179192
dipole: -12.44416 12.32637 -0.11778 -16.49421 15.92609 -0.56811 -27.05502 24.98237 -2.07264
magnitude: 2.15232 au
magnitude: 5.47076 debye
