program: Orca
programVersion: 5.0.2
elementType: S O O O N N C C C C C C C C C C C C C C C C C C C C H H H H H H H H H H H H H H H H H H H H H H H H H H H H H H H H
charge: 0
multiplicity: 1
keywords: wb97x-d3
keywords: def2-TZVPP
keywords: def2/J RIJCOSX
keywords: DEFGRID2
keywords: scfconv7
keywords: smallprint printgap noloewdin
keywords: NOSOSCF
formula: C20H32N2O3S
InChI: InChI=1/C20H32N2O3S/c1-6-8-13-22(14-9-7-2)26-21(5)19(23)24-17-12-10-11-16-15-20(3,4)25-18(16)17/h10-12H,6-9,13-15H2,1-5H3
58 atoms
S  -1.882532 2.323291 0.871781
O  0.848155 -1.454662 0.229306
O  0.645203 1.165335 1.396064
O  -0.005871 -0.391765 2.881187
N  -2.083293 1.718232 -0.655361
N  -1.518749 1.042213 1.977461
C  1.312968 -2.530137 -0.65092
C  2.837311 -2.602885 -0.405144
C  3.128129 -1.269376 0.214632
C  1.911864 -0.70235 0.559872
C  1.003376 -2.115449 -2.079419
C  0.573996 -3.789212 -0.254285
C  4.308609 -0.599052 0.475385
C  1.849012 0.540003 1.168346
C  4.251558 0.649488 1.091214
C  3.030463 1.212441 1.441449
C  -3.257131 0.895393 -0.935751
C  -0.906337 1.38254 -1.458778
C  -3.059896 -0.605363 -0.758935
C  0.067861 2.532815 -1.646943
C  -4.336245 -1.379797 -1.059289
C  1.350116 2.091684 -2.347645
C  -0.276954 0.527509 2.140284
C  -4.144265 -2.883846 -0.944417
C  1.137013 1.536423 -3.748877
C  -2.592041 0.422911 2.746475
H  3.383008 -2.775007 -1.333839
H  3.096622 -3.415515 0.2796
H  -0.065289 -1.940718 -2.218087
H  1.306499 -2.904455 -2.768685
H  1.542603 -1.207194 -2.35844
H  0.768102 -4.051697 0.786558
H  0.903321 -4.621914 -0.875919
H  -0.503235 -3.678233 -0.390631
H  5.262242 -1.031288 0.200922
H  5.163694 1.191304 1.30106
H  2.989406 2.188249 1.908598
H  -3.558965 1.092488 -1.969642
H  -4.072399 1.244226 -0.299139
H  -1.290303 1.076154 -2.434597
H  -0.384752 0.510421 -1.054858
H  -2.265868 -0.957178 -1.425211
H  -2.728096 -0.827103 0.259206
H  -0.415577 3.326574 -2.224286
H  0.327852 2.966416 -0.67939
H  -4.683309 -1.13154 -2.066879
H  -5.127849 -1.056487 -0.376828
H  2.028572 2.946502 -2.400814
H  1.858385 1.342664 -1.731484
H  -5.067941 -3.423209 -1.158067
H  -3.822121 -3.166351 0.059646
H  -3.385913 -3.240645 -1.644119
H  0.612973 2.254692 -4.38295
H  0.552079 0.61535 -3.743218
H  2.089405 1.30915 -4.22946
H  -3.52934 0.904826 2.483284
H  -2.435141 0.551142 3.818271
H  -2.683602 -0.642229 2.53108
elementType: S O N C H
totalener: -1514.91184871 hartree
nucrepener: 2861.73096358 hartree
electener: -4376.64281230 hartree
oneelecener: -7762.37777676 hartree
twoeener: 3385.73496446 hartree
cpcmener: -0.03335802 hartree
kineticenergy: 1509.08324350 hartree
xcener: -129.015716985679 hartree
chargesum: -0.0000000
charge: 0.013320 -0.376161 -0.307015 -0.508689 -0.136589 -0.167065 0.371448 -0.113868 -0.110598 0.317567 -0.356552 -0.296674 -0.185963 0.084164 -0.145623 -0.231082 -0.099539 -0.079636 -0.082435 -0.119631 -0.089625 -0.104789 0.487833 -0.279966 -0.291538 -0.180467 0.101421 0.092850 0.103143 0.118246 0.107410 0.097862 0.102865 0.095440 0.152587 0.159920 0.148568 0.093322 0.095535 0.118833 0.024726 0.058703 0.063543 0.078129 0.074326 0.059334 0.062148 0.081438 0.037951 0.096116 0.080125 0.077153 0.091934 0.074816 0.098253 0.105343 0.125705 0.111427
qa: 0.0133 -0.3762 -0.3070 -0.5087 -0.1366 -0.1671 0.3714 -0.1139 -0.1106 0.3176 -0.3566 -0.2967 -0.1860 0.0842 -0.1456 -0.2311 -0.0995 -0.0796 -0.0824 -0.1196 -0.0896 -0.1048 0.4878 -0.2800 -0.2915 -0.1805 0.1014 0.0928 0.1031 0.1182 0.1074 0.0979 0.1029 0.0954 0.1526 0.1599 0.1486 0.0933 0.0955 0.1188 0.0247 0.0587 0.0635 0.0781 0.0743 0.0593 0.0621 0.0814 0.0380 0.0961 0.0801 0.0772 0.0919 0.0748 0.0983 0.1053 0.1257 0.1114
va: 2.3386 2.0549 2.0697 2.0012 3.0534 3.1505 3.6997 3.9935 3.6765 3.8043 3.9765 3.9459 3.9502 3.7312 3.8518 3.9806 3.9244 3.9303 3.7957 3.8503 3.8951 3.8800 4.2702 3.9384 3.9352 3.8807 1.0042 1.0087 0.9979 1.0103 0.9877 1.0068 1.0026 1.0046 0.9960 0.9877 1.0013 1.0001 1.0114 0.9831 1.0171 1.0179 1.0081 1.0161 1.0320 1.0091 1.0066 1.0098 1.0153 1.0054 0.9998 1.0010 1.0030 0.9967 1.0027 1.0101 0.9968 0.9882
dispcorr: -0.036627530 hartree
energy: -1514.948476242202
dipole: -12.97585 12.82313 -0.15272 -16.00499 14.96958 -1.03541 -27.35289 25.12606 -2.22683
magnitude: 2.46052 au
magnitude: 6.25415 debye
