program: Orca
programVersion: 5.0.2
elementType: S O O O N N C C C C C C C C C C C C C C C C C C C C H H H H H H H H H H H H H H H H H H H H H H H H H H H H H H H H
charge: 0
multiplicity: 1
keywords: wb97x-d3
keywords: def2-TZVPP
keywords: def2/J RIJCOSX
keywords: DEFGRID2
keywords: scfconv7
keywords: smallprint printgap noloewdin
keywords: NOSOSCF
formula: C20H32N2O3S
InChI: InChI=1/C20H32N2O3S/c1-6-8-13-22(14-9-7-2)26-21(5)19(23)24-17-12-10-11-16-15-20(3,4)25-18(16)17/h10-12H,6-9,13-15H2,1-5H3
58 atoms
S  -2.327085 -0.088542 0.431195
O  1.906529 -2.432592 1.092505
O  0.485819 -0.126583 0.232629
O  0.660763 -1.257059 -1.702367
N  -2.735361 1.448661 -0.002594
N  -1.382485 -0.794003 -0.825917
C  2.94543 -3.447711 1.271737
C  4.253341 -2.646784 1.475316
C  3.882681 -1.285262 0.973001
C  2.507791 -1.270819 0.800961
C  2.987737 -4.271619 -0.00354
C  2.566543 -4.283961 2.474557
C  4.629534 -0.151889 0.713012
C  1.856619 -0.133811 0.358891
C  3.977779 0.998685 0.273925
C  2.59996 1.005474 0.093387
C  -3.770345 1.661217 -1.008514
C  -1.775463 2.53277 0.163456
C  -5.061394 0.903506 -0.738969
C  -0.941226 2.879531 -1.065732
C  -5.678156 1.147757 0.634195
C  0.018525 4.028255 -0.780966
C  -0.025559 -0.766439 -0.837069
C  -5.965237 2.611593 0.934993
C  0.864013 4.405366 -1.987984
C  -2.040795 -1.421857 -1.963325
H  5.085111 -3.094535 0.929373
H  4.542154 -2.60985 2.529872
H  3.738839 -5.058063 0.080271
H  3.245292 -3.656421 -0.868171
H  2.024925 -4.746944 -0.197358
H  1.619088 -4.802688 2.319393
H  2.481707 -3.671385 3.373368
H  3.331534 -5.03938 2.657224
H  5.703852 -0.153836 0.848338
H  4.545091 1.895245 0.062668
H  2.095901 1.899935 -0.252486
H  -3.409909 1.413511 -2.014141
H  -3.977057 2.734777 -1.019495
H  -1.12046 2.275993 0.997677
H  -2.337012 3.422235 0.470673
H  -5.7708 1.204894 -1.516048
H  -4.903609 -0.168746 -0.879777
H  -0.375402 2.006295 -1.401762
H  -1.597682 3.158323 -1.895849
H  -5.030364 0.737885 1.413346
H  -6.609845 0.579126 0.695232
H  -0.549696 4.902123 -0.446905
H  0.67284 3.75742 0.053756
H  -6.574647 3.06909 0.152262
H  -5.050685 3.200308 1.026162
H  -6.508195 2.718784 1.875278
H  1.461729 3.560598 -2.337003
H  1.552463 5.219054 -1.754793
H  0.241864 4.732823 -2.823469
H  -1.944719 -0.820224 -2.869009
H  -3.097475 -1.531868 -1.733488
H  -1.633562 -2.41432 -2.157742
elementType: S O N C H
totalener: -1514.92594857 hartree
nucrepener: 2711.64229692 hartree
electener: -4226.56824549 hartree
oneelecener: -7462.51894153 hartree
twoeener: 3235.95069604 hartree
cpcmener: -0.02786519 hartree
kineticenergy: 1509.09459727 hartree
xcener: -129.015584049554 hartree
chargesum: -0.0000000
charge: 0.017016 -0.364877 -0.317946 -0.485986 -0.140634 -0.153830 0.369273 -0.118676 -0.123166 0.293150 -0.323615 -0.295251 -0.167360 0.037492 -0.211217 -0.113325 -0.143388 -0.076740 -0.139207 -0.139298 -0.096964 -0.103996 0.471211 -0.276287 -0.275312 -0.181092 0.097692 0.091494 0.100389 0.109552 0.099338 0.099332 0.096756 0.099842 0.149308 0.151131 0.142508 0.112621 0.112148 0.093221 0.087998 0.079874 0.076620 0.056885 0.086920 0.054536 0.070800 0.080674 0.062687 0.082995 0.077763 0.093167 0.076922 0.091694 0.084709 0.118341 0.105588 0.116521
qa: 0.0170 -0.3649 -0.3179 -0.4860 -0.1406 -0.1538 0.3693 -0.1187 -0.1232 0.2931 -0.3236 -0.2953 -0.1674 0.0375 -0.2112 -0.1133 -0.1434 -0.0767 -0.1392 -0.1393 -0.0970 -0.1040 0.4712 -0.2763 -0.2753 -0.1811 0.0977 0.0915 0.1004 0.1096 0.0993 0.0993 0.0968 0.0998 0.1493 0.1511 0.1425 0.1126 0.1121 0.0932 0.0880 0.0799 0.0766 0.0569 0.0869 0.0545 0.0708 0.0807 0.0627 0.0830 0.0778 0.0932 0.0769 0.0917 0.0847 0.1183 0.1056 0.1165
va: 2.3744 2.0982 2.0941 2.0280 2.9962 3.1776 3.6979 3.9889 3.6775 3.9234 3.9769 3.9489 3.9280 3.9059 3.9463 3.9090 3.8943 3.8897 3.8934 3.8194 3.8734 3.8757 4.2592 3.9274 3.9343 3.8892 1.0036 1.0084 1.0058 0.9989 1.0086 1.0066 1.0054 1.0025 0.9981 0.9946 0.9846 0.9930 0.9833 1.0161 1.0002 1.0132 1.0205 1.0129 1.0116 1.0185 1.0108 1.0058 1.0019 1.0015 0.9995 1.0052 1.0010 1.0041 1.0014 0.9891 1.0034 1.0006
dispcorr: -0.031536073 hartree
energy: -1514.957484646731
dipole: -16.33166 16.24551 -0.08615 14.54402 -14.12853 0.41549 -5.43111 5.56722 0.13611
magnitude: 0.44563 au
magnitude: 1.13269 debye
