program: Orca
programVersion: 5.0.2
elementType: S O O O N N C C C C C C C C C C C C C C C C C C C C H H H H H H H H H H H H H H H H H H H H H H H H H H H H H H H H
charge: 0
multiplicity: 1
keywords: wb97x-d3
keywords: def2-TZVPP
keywords: def2/J RIJCOSX
keywords: DEFGRID2
keywords: scfconv7
keywords: smallprint printgap noloewdin
keywords: NOSOSCF
formula: C20H32N2O3S
InChI: InChI=1/C20H32N2O3S/c1-6-8-13-22(14-9-7-2)26-21(5)19(23)24-17-12-10-11-16-15-20(3,4)25-18(16)17/h10-12H,6-9,13-15H2,1-5H3
58 atoms
S  -1.566929 1.926529 0.606171
O  1.830182 -1.435914 -0.072871
O  0.991479 0.925674 1.268322
O  0.381666 -0.36584 3.001969
N  -2.295593 0.914395 -0.483454
N  -1.141135 0.974425 1.976341
C  2.620132 -2.456498 -0.767181
C  4.033478 -2.378638 -0.137501
C  3.964748 -1.135785 0.693556
C  2.654663 -0.684557 0.668611
C  2.642325 -2.087817 -2.238813
C  1.940719 -3.787875 -0.527563
C  4.920467 -0.463271 1.430075
C  2.280205 0.45092 1.363836
C  4.546596 0.674378 2.142221
C  3.233499 1.125527 2.111607
C  -3.675041 0.497257 -0.236256
C  -1.458482 -0.070261 -1.164408
C  -4.536795 0.570469 -1.489379
C  -0.404527 0.538828 -2.071997
C  -5.966854 0.115435 -1.226448
C  -0.978195 1.391254 -3.195431
C  0.09492 0.436633 2.145583
C  -6.846548 0.198563 -2.464089
C  0.097518 1.906076 -4.140059
C  -2.174834 0.569768 2.919692
H  4.809044 -2.328564 -0.903944
H  4.248507 -3.256105 0.478048
H  3.081421 -1.100871 -2.397208
H  1.638196 -2.089685 -2.665762
H  3.240746 -2.810946 -2.794794
H  1.905625 -4.029827 0.535702
H  2.49058 -4.583176 -1.03214
H  0.921155 -3.790602 -0.916496
H  5.94544 -0.811459 1.455103
H  5.279856 1.212031 2.728146
H  2.945349 2.013111 2.66137
H  -4.099204 1.157199 0.521803
H  -3.701031 -0.517953 0.181155
H  -2.120957 -0.693561 -1.768725
H  -0.990233 -0.749685 -0.440923
H  -4.536016 1.600511 -1.858709
H  -4.107474 -0.0455 -2.285593
H  0.309309 1.12445 -1.486693
H  0.167113 -0.28949 -2.500744
H  -6.402814 0.7236 -0.427853
H  -5.958094 -0.913436 -0.854162
H  -1.707833 0.80216 -3.760773
H  -1.530837 2.235585 -2.775792
H  -6.908931 1.221541 -2.840571
H  -7.863923 -0.134841 -2.25374
H  -6.458113 -0.425011 -3.271803
H  -0.328982 2.510269 -4.942401
H  0.646668 1.084521 -4.60511
H  0.824575 2.528584 -3.614425
H  -2.514791 -0.451341 2.741719
H  -3.02314 1.239815 2.810387
H  -1.818334 0.646102 3.946057
elementType: S O N C H
totalener: -1514.92666079 hartree
nucrepener: 2721.69849279 hartree
electener: -4236.62515358 hartree
oneelecener: -7482.52430245 hartree
twoeener: 3245.89914887 hartree
cpcmener: -0.02747278 hartree
kineticenergy: 1509.10608205 hartree
xcener: -129.012836496707 hartree
chargesum: -0.0000000
charge: 0.018971 -0.359381 -0.319709 -0.487276 -0.131294 -0.156960 0.364606 -0.130485 -0.117796 0.301565 -0.345838 -0.302902 -0.173918 0.062974 -0.166652 -0.173821 -0.102103 -0.151097 -0.094880 -0.110265 -0.083459 -0.069511 0.478112 -0.280418 -0.282432 -0.183085 0.097770 0.095218 0.114369 0.101650 0.112451 0.100258 0.101661 0.099581 0.149147 0.154909 0.148516 0.090225 0.094238 0.116548 0.108783 0.057993 0.061989 0.065131 0.064836 0.059703 0.057400 0.055603 0.053238 0.079088 0.090183 0.078917 0.090226 0.077349 0.080399 0.120810 0.103095 0.115772
qa: 0.0190 -0.3594 -0.3197 -0.4873 -0.1313 -0.1570 0.3646 -0.1305 -0.1178 0.3016 -0.3458 -0.3029 -0.1739 0.0630 -0.1667 -0.1738 -0.1021 -0.1511 -0.0949 -0.1103 -0.0835 -0.0695 0.4781 -0.2804 -0.2824 -0.1831 0.0978 0.0952 0.1144 0.1017 0.1125 0.1003 0.1017 0.0996 0.1491 0.1549 0.1485 0.0902 0.0942 0.1165 0.1088 0.0580 0.0620 0.0651 0.0648 0.0597 0.0574 0.0556 0.0532 0.0791 0.0902 0.0789 0.0902 0.0773 0.0804 0.1208 0.1031 0.1158
va: 2.3459 2.0833 2.0952 2.0245 2.9790 3.1785 3.6879 4.0289 3.7021 3.9234 3.9692 3.9617 3.9485 3.7806 3.8912 4.0056 3.9214 3.9178 3.8558 3.8432 3.8864 3.8648 4.2601 3.9511 3.9540 3.8924 1.0045 1.0065 0.9963 1.0001 1.0066 1.0037 1.0027 1.0055 0.9969 0.9901 0.9969 1.0097 0.9932 0.9889 1.0209 1.0201 1.0165 1.0218 1.0215 1.0061 1.0082 1.0084 1.0229 1.0002 1.0042 1.0007 1.0040 1.0004 0.9999 0.9870 1.0081 1.0017
dispcorr: -0.031281371 hartree
energy: -1514.957942159120
dipole: -24.82709 24.54713 -0.27996 -9.22561 8.11170 -1.11391 -30.33627 28.92960 -1.40667
magnitude: 1.81601 au
magnitude: 4.61592 debye
