program: Orca
programVersion: 5.0.2
elementType: S O O O N N C C C C C C C C C C C C C C C C C C C C H H H H H H H H H H H H H H H H H H H H H H H H H H H H H H H H
charge: 0
multiplicity: 1
keywords: wb97x-d3
keywords: def2-TZVPP
keywords: def2/J RIJCOSX
keywords: DEFGRID2
keywords: scfconv7
keywords: smallprint printgap noloewdin
keywords: NOSOSCF
formula: C20H32N2O3S
InChI: InChI=1/C20H32N2O3S/c1-6-8-13-22(14-9-7-2)26-21(5)19(23)24-17-12-10-11-16-15-20(3,4)25-18(16)17/h10-12H,6-9,13-15H2,1-5H3
58 atoms
S  -0.405508 1.263754 -1.866885
O  2.42984 -2.430787 -0.170213
O  0.622678 -0.269171 0.262513
O  -0.713742 -2.063693 0.051268
N  -1.381101 2.357157 -1.13142
N  -0.907761 -0.314791 -1.38405
C  3.200769 -3.660538 0.011929
C  3.751633 -3.574161 1.45515
C  2.880724 -2.522512 2.070979
C  2.17492 -1.919236 1.042021
C  4.285913 -3.682946 -1.041211
C  2.233727 -4.820785 -0.145832
C  2.720897 -2.090878 3.373918
C  1.289883 -0.88746 1.295307
C  1.8375 -1.045055 3.633591
C  1.123942 -0.450113 2.600477
C  -1.118477 2.819334 0.222538
C  -2.640004 2.75384 -1.753643
C  -1.89383 2.087221 1.311711
C  -2.47267 3.94386 -2.686434
C  -1.611084 2.66279 2.693478
C  -3.78012 4.36922 -3.339944
C  -0.364171 -0.971031 -0.328188
C  -2.33653 1.919128 3.80362
C  -3.601635 5.54036 -4.293444
C  -2.017885 -0.964614 -2.066614
H  4.802466 -3.270119 1.467999
H  3.688147 -4.536988 1.964537
H  4.94573 -2.818704 -0.952384
H  3.865798 -3.695722 -2.048266
H  4.894927 -4.580042 -0.924774
H  1.768091 -4.814455 -1.132492
H  1.442227 -4.785795 0.605775
H  2.760416 -5.768908 -0.030238
H  3.27284 -2.554942 4.18174
H  1.696294 -0.693769 4.646953
H  0.434274 0.360336 2.804407
H  -1.354568 3.888068 0.267398
H  -0.046344 2.734741 0.410177
H  -3.358029 2.996297 -0.965175
H  -3.068751 1.909371 -2.297572
H  -2.967585 2.145913 1.106422
H  -1.636405 1.024758 1.300454
H  -2.049692 4.784387 -2.126391
H  -1.742295 3.687348 -3.460791
H  -1.896958 3.7191 2.713423
H  -0.533275 2.637939 2.884042
H  -4.20994 3.520697 -3.88132
H  -4.507339 4.634989 -2.566408
H  -3.419265 1.956136 3.667333
H  -2.115237 2.347665 4.782307
H  -2.046481 0.866703 3.833417
H  -3.201481 6.415681 -3.777677
H  -4.548138 5.83343 -4.750179
H  -2.911029 5.292206 -5.101928
H  -2.215648 -0.429248 -2.989445
H  -2.924405 -0.957278 -1.461678
H  -1.775131 -1.994488 -2.321299
elementType: S O N C H
totalener: -1514.92649625 hartree
nucrepener: 2666.95867853 hartree
electener: -4181.88517479 hartree
oneelecener: -7373.18533966 hartree
twoeener: 3191.30016487 hartree
cpcmener: -0.02794851 hartree
kineticenergy: 1509.10769162 hartree
xcener: -129.016191862230 hartree
chargesum: 0.0000000
charge: 0.018797 -0.365265 -0.318056 -0.485069 -0.154239 -0.149199 0.369961 -0.117389 -0.120762 0.293272 -0.293359 -0.325095 -0.171267 0.040261 -0.209236 -0.118054 -0.071468 -0.093553 -0.136441 -0.083752 -0.104255 -0.089538 0.470874 -0.273348 -0.276230 -0.181191 0.090942 0.097985 0.096142 0.099328 0.099005 0.099259 0.109102 0.100518 0.148826 0.151294 0.141779 0.095068 0.091882 0.094840 0.093091 0.084741 0.047218 0.061797 0.052489 0.079893 0.061385 0.057222 0.058734 0.083076 0.091844 0.075420 0.078406 0.089863 0.078400 0.097983 0.121816 0.114250
qa: 0.0188 -0.3653 -0.3181 -0.4851 -0.1542 -0.1492 0.3700 -0.1174 -0.1208 0.2933 -0.2934 -0.3251 -0.1713 0.0403 -0.2092 -0.1181 -0.0715 -0.0936 -0.1364 -0.0838 -0.1043 -0.0895 0.4709 -0.2733 -0.2762 -0.1812 0.0909 0.0980 0.0961 0.0993 0.0990 0.0993 0.1091 0.1005 0.1488 0.1513 0.1418 0.0951 0.0919 0.0948 0.0931 0.0847 0.0472 0.0618 0.0525 0.0799 0.0614 0.0572 0.0587 0.0831 0.0918 0.0754 0.0784 0.0899 0.0784 0.0980 0.1218 0.1142
va: 2.3804 2.0995 2.0957 2.0290 3.0451 3.1708 3.6976 3.9862 3.6750 3.9071 3.9470 3.9774 3.9308 3.9238 3.9449 3.9093 3.8949 3.9117 3.8180 3.8667 3.8727 3.8856 4.2647 3.9384 3.9478 3.8915 1.0087 1.0034 1.0059 1.0065 1.0029 1.0086 0.9992 1.0061 0.9984 0.9945 0.9854 0.9969 1.0152 1.0020 0.9976 1.0155 1.0180 1.0155 1.0223 1.0059 1.0015 1.0070 1.0072 1.0012 1.0039 1.0017 1.0008 1.0040 1.0005 1.0111 0.9863 1.0002
dispcorr: -0.029863544 hartree
energy: -1514.956359797714
dipole: -19.11325 19.01800 -0.09525 17.97962 -17.45336 0.52626 -3.64932 3.85331 0.20400
magnitude: 0.57239 au
magnitude: 1.45491 debye
