program: Orca
programVersion: 5.0.2
elementType: S O O O N N C C C C C C C C C C C C C C C C C C C C H H H H H H H H H H H H H H H H H H H H H H H H H H H H H H H H
charge: 0
multiplicity: 1
keywords: wb97x-d3
keywords: def2-TZVPP
keywords: def2/J RIJCOSX
keywords: DEFGRID2
keywords: scfconv7
keywords: smallprint printgap noloewdin
keywords: NOSOSCF
formula: C20H32N2O3S
InChI: InChI=1/C20H32N2O3S/c1-6-8-13-22(14-9-7-2)26-21(5)19(23)24-17-12-10-11-16-15-20(3,4)25-18(16)17/h10-12H,6-9,13-15H2,1-5H3
58 atoms
S  -1.914143 2.160377 1.099897
O  1.010266 -1.380738 -0.026501
O  0.643307 1.007014 1.493425
O  0.029762 -0.716101 2.802818
N  -1.945011 1.763317 -0.501672
N  -1.514456 0.770601 2.051676
C  1.542734 -2.631684 -0.571372
C  3.075879 -2.421954 -0.627746
C  3.276878 -1.216346 0.23868
C  2.025056 -0.691241 0.513598
C  0.920944 -2.83762 -1.93553
C  1.162557 -3.734621 0.399556
C  4.414288 -0.593739 0.718453
C  1.882323 0.453075 1.280809
C  4.277558 0.563406 1.481356
C  3.019052 1.080533 1.765192
C  -2.994632 0.87846 -0.995419
C  -0.687947 1.788671 -1.252506
C  -2.666368 -0.610291 -0.923696
C  -0.879107 2.187261 -2.709812
C  -3.680879 -1.478892 -1.662291
C  0.445128 2.518891 -3.394779
C  -0.260553 0.272689 2.170975
C  -5.096059 -1.394394 -1.107409
C  1.434281 1.361793 -3.446625
C  -2.574514 0.050395 2.744815
H  3.419773 -2.233029 -1.64875
H  3.611355 -3.301555 -0.266603
H  1.140134 -2.000195 -2.600182
H  -0.162321 -2.954389 -1.870583
H  1.323825 -3.741409 -2.394305
H  1.518536 -4.698055 0.032449
H  0.079658 -3.800415 0.516302
H  1.603646 -3.569576 1.384706
H  5.397319 -0.993052 0.502412
H  5.155633 1.065707 1.864628
H  2.915015 1.978402 2.361622
H  -3.207872 1.149336 -2.034103
H  -3.901458 1.101405 -0.430858
H  -0.172917 0.8259 -1.197067
H  -0.041133 2.522925 -0.770512
H  -1.677584 -0.789238 -1.355105
H  -2.606364 -0.930297 0.120226
H  -1.376161 1.387874 -3.26787
H  -1.535788 3.060614 -2.758942
H  -3.34196 -2.517575 -1.622085
H  -3.686275 -1.205312 -2.722466
H  0.232727 2.850863 -4.414243
H  0.909189 3.371844 -2.890133
H  -5.532903 -0.403162 -1.239797
H  -5.118592 -1.623275 -0.03929
H  -5.757343 -2.1042 -1.607107
H  2.316787 1.62987 -4.029829
H  0.989607 0.480428 -3.914813
H  1.783318 1.069149 -2.454912
H  -3.521969 0.532351 2.52309
H  -2.426814 0.074039 3.824904
H  -2.636599 -0.989968 2.424534
elementType: S O N C H
totalener: -1514.92315661 hartree
nucrepener: 2830.98106913 hartree
electener: -4345.90422574 hartree
oneelecener: -7700.91270933 hartree
twoeener: 3355.00848359 hartree
cpcmener: -0.02605270 hartree
kineticenergy: 1509.07504189 hartree
xcener: -129.012128046208 hartree
chargesum: 0.0000000
charge: 0.009982 -0.356651 -0.317578 -0.480437 -0.125268 -0.168268 0.360989 -0.134527 -0.099191 0.308066 -0.316275 -0.324271 -0.178703 0.078385 -0.157159 -0.210260 -0.135153 -0.087047 -0.081567 -0.096037 -0.115160 -0.113903 0.473069 -0.274849 -0.270012 -0.177296 0.092289 0.099954 0.097036 0.097419 0.116586 0.101814 0.099287 0.109923 0.149100 0.154840 0.146612 0.106528 0.104987 0.041368 0.097033 0.055278 0.077633 0.068333 0.077213 0.068256 0.062028 0.070527 0.058619 0.081443 0.079466 0.093302 0.096338 0.079035 0.072636 0.101613 0.124434 0.108193
qa: 0.0100 -0.3567 -0.3176 -0.4804 -0.1253 -0.1683 0.3610 -0.1345 -0.0992 0.3081 -0.3163 -0.3243 -0.1787 0.0784 -0.1572 -0.2103 -0.1352 -0.0870 -0.0816 -0.0960 -0.1152 -0.1139 0.4731 -0.2748 -0.2700 -0.1773 0.0923 0.1000 0.0970 0.0974 0.1166 0.1018 0.0993 0.1099 0.1491 0.1548 0.1466 0.1065 0.1050 0.0414 0.0970 0.0553 0.0776 0.0683 0.0772 0.0683 0.0620 0.0705 0.0586 0.0814 0.0795 0.0933 0.0963 0.0790 0.0726 0.1016 0.1244 0.1082
va: 2.3427 2.0640 2.0773 2.0345 3.0627 3.1420 3.7241 4.0196 3.6853 3.8481 3.9416 3.9775 3.9502 3.7792 3.8790 4.0061 3.9303 3.9439 3.8041 3.8491 3.9211 3.9079 4.2817 3.9340 3.9297 3.8822 1.0074 1.0035 1.0023 1.0037 1.0049 1.0056 1.0073 0.9987 0.9969 0.9897 1.0005 0.9886 1.0099 1.0027 1.0150 1.0227 1.0095 1.0082 1.0175 1.0077 1.0077 1.0074 1.0088 0.9987 1.0006 1.0047 1.0062 1.0012 0.9973 1.0136 0.9966 0.9896
dispcorr: -0.034964166 hartree
energy: -1514.958120778450
dipole: -13.86865 13.89595 0.02729 -13.50447 12.62962 -0.87485 -28.65221 26.65739 -1.99482
magnitude: 2.17840 au
magnitude: 5.53704 debye
