program: Orca
programVersion: 5.0.2
elementType: S O O O N N C C C C C C C C C C C C C C C C C C C C H H H H H H H H H H H H H H H H H H H H H H H H H H H H H H H H
charge: 0
multiplicity: 1
keywords: wb97x-d3
keywords: def2-TZVPP
keywords: def2/J RIJCOSX
keywords: DEFGRID2
keywords: scfconv7
keywords: smallprint printgap noloewdin
keywords: NOSOSCF
formula: C20H32N2O3S
InChI: InChI=1/C20H32N2O3S/c1-6-8-13-22(14-9-7-2)26-21(5)19(23)24-17-12-10-11-16-15-20(3,4)25-18(16)17/h10-12H,6-9,13-15H2,1-5H3
58 atoms
S  -2.173585 0.146637 0.648395
O  2.084307 -1.998969 1.558828
O  0.544696 -0.222141 -0.044224
O  0.337373 -2.186713 -1.113675
N  -2.740009 1.242953 -0.454071
N  -1.487949 -1.173882 -0.219079
C  3.133997 -2.91138 2.012185
C  4.457015 -2.196698 1.654024
C  4.014079 -1.201979 0.625257
C  2.629687 -1.155205 0.67182
C  2.974518 -4.202692 1.228715
C  2.947582 -3.120943 3.498352
C  4.710513 -0.384851 -0.244331
C  1.915095 -0.301212 -0.147996
C  3.996224 0.477293 -1.073553
C  2.607902 0.515713 -1.027704
C  -3.981084 0.944441 -1.167457
C  -1.766592 2.035169 -1.201488
C  -4.933384 2.132782 -1.200764
C  -0.915684 2.939193 -0.32617
C  -5.414348 2.561434 0.17896
C  0.122912 3.703548 -1.137273
C  -0.16438 -1.267734 -0.510639
C  -6.354879 3.755325 0.128265
C  1.011079 4.581843 -0.269899
C  -2.349066 -2.236181 -0.723175
H  5.204029 -2.900225 1.28371
H  4.889768 -1.692431 2.523221
H  3.102103 -4.039186 0.156495
H  1.989795 -4.643969 1.390598
H  3.723392 -4.929882 1.544984
H  3.725995 -3.782492 3.880389
H  1.98336 -3.581247 3.720029
H  3.014461 -2.178284 4.043247
H  5.792285 -0.41163 -0.28286
H  4.521186 1.12153 -1.766128
H  2.057827 1.183313 -1.679008
H  -4.473743 0.111785 -0.662623
H  -3.761845 0.606391 -2.188012
H  -2.325812 2.655372 -1.905691
H  -1.129581 1.385391 -1.816585
H  -4.467336 2.981586 -1.712187
H  -5.792386 1.850558 -1.818074
H  -1.567328 3.643775 0.200205
H  -0.408891 2.350022 0.442455
H  -4.554427 2.802935 0.808649
H  -5.917652 1.718015 0.66268
H  0.745978 2.993915 -1.6902
H  -0.376648 4.318817 -1.8924
H  -6.693064 4.039807 1.126124
H  -7.243509 3.541557 -0.469779
H  -5.86586 4.627106 -0.311945
H  0.427272 5.331437 0.268517
H  1.754683 5.112485 -0.866578
H  1.549742 3.98885 0.472746
H  -1.958961 -3.218619 -0.459328
H  -2.463627 -2.183978 -1.806742
H  -3.330197 -2.131964 -0.269082
elementType: S O N C H
totalener: -1514.92702415 hartree
nucrepener: 2690.66184648 hartree
electener: -4205.58887063 hartree
oneelecener: -7420.65227837 hartree
twoeener: 3215.06340774 hartree
cpcmener: -0.02754918 hartree
kineticenergy: 1509.09703540 hartree
xcener: -129.011803096049 hartree
chargesum: -0.0000000
charge: 0.016542 -0.367548 -0.316282 -0.483985 -0.133465 -0.159871 0.370091 -0.115488 -0.103070 0.270699 -0.325582 -0.294278 -0.185907 0.082704 -0.185462 -0.188290 -0.112656 -0.135026 -0.110242 -0.112477 -0.080450 -0.105882 0.475812 -0.281599 -0.279485 -0.172898 0.097961 0.090470 0.109868 0.099177 0.100465 0.099214 0.100040 0.096166 0.149131 0.154076 0.170734 0.095375 0.111084 0.109660 0.098801 0.063246 0.078865 0.077243 0.061866 0.051156 0.058103 0.057518 0.073141 0.089312 0.077533 0.079056 0.082414 0.090088 0.078923 0.115668 0.119857 0.097882
qa: 0.0165 -0.3675 -0.3163 -0.4840 -0.1335 -0.1599 0.3701 -0.1155 -0.1031 0.2707 -0.3256 -0.2943 -0.1859 0.0827 -0.1855 -0.1883 -0.1127 -0.1350 -0.1102 -0.1125 -0.0805 -0.1059 0.4758 -0.2816 -0.2795 -0.1729 0.0980 0.0905 0.1099 0.0992 0.1005 0.0992 0.1000 0.0962 0.1491 0.1541 0.1707 0.0954 0.1111 0.1097 0.0988 0.0632 0.0789 0.0772 0.0619 0.0512 0.0581 0.0575 0.0731 0.0893 0.0775 0.0791 0.0824 0.0901 0.0789 0.1157 0.1199 0.0979
va: 2.3463 2.0963 2.0939 2.0313 2.9881 3.1751 3.7021 3.9803 3.6651 3.9117 3.9784 3.9457 3.9583 3.8668 3.9220 3.9525 3.9235 3.9222 3.8675 3.8414 3.8395 3.8849 4.2713 3.9541 3.9428 3.8837 1.0037 1.0091 0.9984 1.0090 1.0061 1.0028 1.0062 1.0060 0.9986 0.9930 0.9825 1.0048 0.9979 0.9970 1.0032 1.0119 1.0137 1.0148 1.0277 1.0255 1.0084 1.0096 1.0084 1.0037 1.0004 1.0007 1.0010 1.0041 1.0012 0.9996 0.9879 1.0116
dispcorr: -0.030344597 hartree
energy: -1514.957368743999
dipole: -17.00550 16.96313 -0.04237 18.37230 -18.06365 0.30865 -1.54138 1.44625 -0.09513
magnitude: 0.32574 au
magnitude: 0.82797 debye
