program: Orca
programVersion: 5.0.2
elementType: S O O O N N C C C C C C C C C C C C C C C C C C C C H H H H H H H H H H H H H H H H H H H H H H H H H H H H H H H H
charge: 0
multiplicity: 1
keywords: wb97x-d3
keywords: def2-TZVPP
keywords: def2/J RIJCOSX
keywords: DEFGRID2
keywords: scfconv7
keywords: smallprint printgap noloewdin
keywords: NOSOSCF
formula: C20H32N2O3S
InChI: InChI=1/C20H32N2O3S/c1-6-8-13-22(14-9-7-2)26-21(5)19(23)24-17-12-10-11-16-15-20(3,4)25-18(16)17/h10-12H,6-9,13-15H2,1-5H3
58 atoms
S  -0.473438 2.643751 -0.059599
O  1.038537 -2.275645 -0.047052
O  0.929735 0.422381 0.981772
O  2.523867 0.279274 -0.598098
N  -1.860609 2.015272 -0.681677
N  0.878313 1.8349 -0.765528
C  1.48262 -3.643591 -0.309061
C  1.819484 -4.216641 1.085331
C  1.991741 -2.976042 1.907117
C  1.495613 -1.916682 1.161183
C  2.719991 -3.550663 -1.185033
C  0.352057 -4.371844 -1.001365
C  2.475879 -2.768745 3.183921
C  1.482058 -0.630835 1.673915
C  2.460334 -1.477736 3.706673
C  1.971296 -0.417635 2.95457
C  -2.423681 0.7854 -0.142421
C  -2.289635 2.416112 -2.020062
C  -2.029683 -0.483722 -0.88627
C  -2.6540 3.889056 -2.117753
C  -2.744001 -1.725749 -0.361092
C  -3.812561 4.288843 -1.213659
C  1.523142 0.801331 -0.166042
C  -2.478238 -2.028749 1.107453
C  -4.221509 5.743091 -1.388242
C  1.43572 2.314236 -2.0247
H  2.710598 -4.845366 1.055605
H  1.002074 -4.831002 1.475206
H  3.528951 -3.016798 -0.6820
H  2.501874 -3.034257 -2.12112
H  3.084452 -4.549095 -1.430043
H  0.644141 -5.403803 -1.199222
H  0.105326 -3.909064 -1.958298
H  -0.546468 -4.393837 -0.382669
H  2.856266 -3.594355 3.772148
H  2.836343 -1.291943 4.703696
H  1.961167 0.585581 3.362201
H  -3.51486 0.887947 -0.157503
H  -2.132736 0.723172 0.906765
H  -3.172785 1.820222 -2.264627
H  -1.535594 2.160467 -2.771975
H  -2.262206 -0.368502 -1.949075
H  -0.949939 -0.630006 -0.822888
H  -1.778367 4.507811 -1.898232
H  -2.914286 4.094608 -3.161071
H  -2.434311 -2.582562 -0.965043
H  -3.821685 -1.620162 -0.520867
H  -4.671265 3.641541 -1.420095
H  -3.542129 4.111597 -0.169703
H  -2.911608 -1.278156 1.769689
H  -1.408613 -2.071518 1.319151
H  -2.906517 -2.991037 1.392098
H  -4.542705 5.948453 -2.411534
H  -3.394386 6.419474 -1.162536
H  -5.048459 6.007107 -0.727064
H  2.490496 2.568894 -1.923303
H  0.900523 3.211938 -2.318937
H  1.328685 1.573374 -2.817252
elementType: S O N C H
totalener: -1514.92522498 hartree
nucrepener: 2764.44644863 hartree
electener: -4279.37167361 hartree
oneelecener: -7568.30812839 hartree
twoeener: 3288.93645478 hartree
cpcmener: -0.02593155 hartree
kineticenergy: 1509.10178273 hartree
xcener: -129.017702645628 hartree
chargesum: -0.0000000
charge: 0.018585 -0.351254 -0.310502 -0.483644 -0.148939 -0.161369 0.371126 -0.131965 -0.065073 0.243607 -0.324351 -0.316058 -0.191905 0.084911 -0.154930 -0.203232 -0.086398 -0.136513 -0.094275 -0.109703 -0.141648 -0.065270 0.480138 -0.282300 -0.283379 -0.180439 0.100315 0.089841 0.109096 0.099259 0.101181 0.111234 0.104577 0.094584 0.148675 0.154931 0.145353 0.093097 0.095120 0.102837 0.115824 0.083873 0.042111 0.059520 0.072597 0.075874 0.071328 0.057238 0.053249 0.093776 0.068738 0.098387 0.077540 0.078786 0.089465 0.114871 0.100331 0.121168
qa: 0.0186 -0.3513 -0.3105 -0.4836 -0.1489 -0.1614 0.3711 -0.1320 -0.0651 0.2436 -0.3244 -0.3161 -0.1919 0.0849 -0.1549 -0.2032 -0.0864 -0.1365 -0.0943 -0.1097 -0.1416 -0.0653 0.4801 -0.2823 -0.2834 -0.1804 0.1003 0.0898 0.1091 0.0993 0.1012 0.1112 0.1046 0.0946 0.1487 0.1549 0.1454 0.0931 0.0951 0.1028 0.1158 0.0839 0.0421 0.0595 0.0726 0.0759 0.0713 0.0572 0.0532 0.0938 0.0687 0.0984 0.0775 0.0788 0.0895 0.1149 0.1003 0.1212
va: 2.3804 2.0664 2.0887 2.0321 3.0123 3.1713 3.7222 4.0054 3.6406 3.8815 3.9733 3.9305 3.9585 3.8280 3.8765 3.9948 3.8771 3.9228 3.8051 3.8653 3.8997 3.8352 4.2471 3.9228 3.9550 3.8942 1.0041 1.0086 0.9991 1.0097 1.0064 1.0064 1.0043 0.9999 0.9978 0.9899 1.0007 0.9965 1.0125 0.9953 0.9910 1.0201 1.0441 1.0273 1.0166 1.0026 1.0121 1.0079 1.0211 1.0008 1.0018 1.0048 1.0007 0.9998 1.0034 0.9992 1.0052 0.9885
dispcorr: -0.033562837 hartree
energy: -1514.958787816610
dipole: -25.59005 24.40279 -1.18726 -1.43039 0.34660 -1.08379 -15.72450 15.09344 -0.63106
magnitude: 1.72697 au
magnitude: 4.38960 debye
