program: Orca
programVersion: 5.0.2
elementType: S O O O N N C C C C C C C C C C C C C C C C C C C C H H H H H H H H H H H H H H H H H H H H H H H H H H H H H H H H
charge: 0
multiplicity: 1
keywords: wb97x-d3
keywords: def2-TZVPP
keywords: def2/J RIJCOSX
keywords: DEFGRID2
keywords: scfconv7
keywords: smallprint printgap noloewdin
keywords: NOSOSCF
formula: C20H32N2O3S
InChI: InChI=1/C20H32N2O3S/c1-6-8-13-22(14-9-7-2)26-21(5)19(23)24-17-12-10-11-16-15-20(3,4)25-18(16)17/h10-12H,6-9,13-15H2,1-5H3
58 atoms
S  -1.921407 2.119305 0.828279
O  1.027042 -1.505931 0.01519
O  0.67721 1.066462 1.191265
O  0.207676 -0.417093 2.813075
N  -2.213208 1.491793 -0.67157
N  -1.439561 0.860184 1.910029
C  1.565022 -2.807246 -0.383826
C  3.080011 -2.566464 -0.588323
C  3.298525 -1.251029 0.095024
C  2.051058 -0.723179 0.383356
C  0.851291 -3.22582 -1.651014
C  1.302392 -3.766923 0.762691
C  4.44311 -0.538139 0.399952
C  1.919472 0.515715 0.987137
C  4.317535 0.711307 1.002648
C  3.063511 1.23395 1.297376
C  -3.415848 0.694392 -0.887403
C  -1.093242 1.184513 -1.560372
C  -3.246273 -0.804935 -0.660489
C  -0.154801 2.355914 -1.791994
C  -4.559195 -1.576501 -0.765929
C  1.047795 1.955327 -2.637499
C  -0.158747 0.431981 2.035294
C  -5.209149 -1.519884 -2.142018
C  2.023029 3.103439 -2.842391
C  -2.427476 0.240236 2.783494
H  3.338047 -2.503839 -1.649538
H  3.673796 -3.37633 -0.161631
H  1.243285 -4.181384 -2.001074
H  0.995434 -2.4941 -2.447635
H  -0.220383 -3.348779 -1.484581
H  1.668971 -4.763152 0.511655
H  0.234852 -3.846316 0.973872
H  1.809012 -3.446745 1.67541
H  5.422208 -0.939324 0.170002
H  5.201512 1.283491 1.250288
H  2.968988 2.205617 1.765922
H  -3.74421 0.879143 -1.914646
H  -4.198939 1.083992 -0.232707
H  -1.532826 0.892416 -2.518501
H  -0.531728 0.313461 -1.208185
H  -2.531849 -1.211413 -1.38349
H  -2.813263 -0.977559 0.327753
H  -0.703463 3.16659 -2.281393
H  0.197838 2.752952 -0.838094
H  -5.261391 -1.203778 -0.013443
H  -4.367801 -2.620743 -0.505909
H  1.567878 1.12175 -2.154391
H  0.710851 1.581037 -3.609243
H  -6.086517 -2.16693 -2.187941
H  -4.517775 -1.85147 -2.920069
H  -5.53987 -0.51372 -2.403608
H  1.547016 3.947968 -3.344878
H  2.877574 2.800176 -3.449169
H  2.411531 3.465545 -1.888252
H  -2.2520 0.496517 3.829159
H  -2.425309 -0.845388 2.685892
H  -3.412453 0.604193 2.506566
elementType: S O N C H
totalener: -1514.92555921 hartree
nucrepener: 2817.14073548 hartree
electener: -4332.06629469 hartree
oneelecener: -7673.34946768 hartree
twoeener: 3341.28317298 hartree
cpcmener: -0.02587396 hartree
kineticenergy: 1509.09120886 hartree
xcener: -129.013801395719 hartree
chargesum: 0.0000000
charge: 0.015713 -0.360337 -0.308864 -0.479548 -0.139471 -0.171417 0.360220 -0.135525 -0.098337 0.337900 -0.308424 -0.324007 -0.173109 0.037974 -0.157113 -0.208488 -0.102792 -0.090569 -0.111529 -0.127285 -0.107385 -0.078407 0.474058 -0.274941 -0.289430 -0.188000 0.091938 0.099527 0.109330 0.097992 0.098609 0.101038 0.099466 0.109945 0.149160 0.155090 0.145586 0.097259 0.097295 0.106867 0.059637 0.073500 0.080335 0.079308 0.064507 0.058137 0.069930 0.049598 0.068828 0.092048 0.080733 0.079770 0.081251 0.090545 0.078410 0.126612 0.111054 0.105807
qa: 0.0157 -0.3603 -0.3089 -0.4795 -0.1395 -0.1714 0.3602 -0.1355 -0.0983 0.3379 -0.3084 -0.3240 -0.1731 0.0380 -0.1571 -0.2085 -0.1028 -0.0906 -0.1115 -0.1273 -0.1074 -0.0784 0.4741 -0.2749 -0.2894 -0.1880 0.0919 0.0995 0.1093 0.0980 0.0986 0.1010 0.0995 0.1099 0.1492 0.1551 0.1456 0.0973 0.0973 0.1069 0.0596 0.0735 0.0803 0.0793 0.0645 0.0581 0.0699 0.0496 0.0688 0.0920 0.0807 0.0798 0.0813 0.0905 0.0784 0.1266 0.1111 0.1058
va: 2.3461 2.0611 2.0668 2.0375 3.0344 3.1372 3.7344 4.0261 3.7035 3.8018 3.9325 3.9757 3.9524 3.7470 3.8749 3.9876 3.9018 3.9049 3.8186 3.8667 3.9105 3.8728 4.2831 3.9342 3.9544 3.8871 1.0075 1.0030 1.0045 1.0046 1.0055 1.0058 1.0080 0.9985 0.9964 0.9894 1.0007 0.9966 1.0111 0.9963 1.0100 1.0139 1.0123 1.0161 1.0285 1.0077 1.0054 1.0059 1.0070 1.0048 0.9999 0.9988 1.0007 1.0037 1.0011 0.9972 0.9893 1.0084
dispcorr: -0.033910901 hartree
energy: -1514.959470109623
dipole: -13.94957 13.72672 -0.22286 -12.67903 11.43521 -1.24383 -24.03621 22.30202 -1.73419
magnitude: 2.14574 au
magnitude: 5.45403 debye
