program: Orca
programVersion: 5.0.2
elementType: S O O O N N C C C C C C C C C C C C C C C C C C C C H H H H H H H H H H H H H H H H H H H H H H H H H H H H H H H H
charge: 0
multiplicity: 1
keywords: wb97x-d3
keywords: def2-TZVPP
keywords: def2/J RIJCOSX
keywords: DEFGRID2
keywords: scfconv7
keywords: smallprint printgap noloewdin
keywords: NOSOSCF
formula: C20H32N2O3S
InChI: InChI=1/C20H32N2O3S/c1-6-8-13-22(14-9-7-2)26-21(5)19(23)24-17-12-10-11-16-15-20(3,4)25-18(16)17/h10-12H,6-9,13-15H2,1-5H3
58 atoms
S  -1.955642 2.074673 0.726012
O  1.104701 -1.492497 -0.059527
O  0.605903 1.011066 1.211103
O  0.040483 -0.564666 2.710537
N  -2.206298 1.486882 -0.799205
N  -1.547965 0.774167 1.788261
C  1.704071 -2.693543 -0.644278
C  3.2353 -2.450249 -0.608014
C  3.35937 -1.166419 0.153196
C  2.079882 -0.702166 0.405976
C  1.167063 -2.821237 -2.055056
C  1.294007 -3.864271 0.228214
C  4.459481 -0.434534 0.561135
C  1.871776 0.497438 1.066507
C  4.257212 0.769591 1.230521
C  2.9708 1.231404 1.483851
C  -3.430124 0.742274 -1.076332
C  -1.058051 1.135038 -1.633862
C  -3.32544 -0.770062 -0.905146
C  -0.062811 2.266686 -1.820999
C  -4.656028 -1.481714 -1.13836
C  1.154198 1.816533 -2.620099
C  -0.278028 0.328953 1.962239
C  -5.692204 -1.225035 -0.052837
C  2.20023 2.911114 -2.75915
C  -2.584476 0.131321 2.586096
H  3.650787 -2.358403 -1.614862
H  3.759026 -3.275906 -0.122214
H  0.080678 -2.927286 -2.06087
H  1.590195 -3.703241 -2.537361
H  1.43122 -1.951856 -2.6599
H  1.70516 -4.792189 -0.171386
H  0.208567 -3.969517 0.266739
H  1.664205 -3.748075 1.248489
H  5.463479 -0.786315 0.359248
H  5.105098 1.356341 1.557476
H  2.815973 2.172761 1.996309
H  -3.723391 0.959992 -2.109406
H  -4.21382 1.151982 -0.4375
H  -1.461858 0.85875 -2.612147
H  -0.549648 0.242901 -1.254382
H  -2.585392 -1.162138 -1.608436
H  -2.955287 -1.011691 0.094853
H  -0.555418 3.101084 -2.329768
H  0.266951 2.646412 -0.85197
H  -4.470748 -2.556833 -1.202809
H  -5.060981 -1.188669 -2.112374
H  1.606073 0.946775 -2.132075
H  0.841183 1.478851 -3.612956
H  -5.319199 -1.530411 0.92715
H  -6.60771 -1.787522 -0.243012
H  -5.971963 -0.172684 0.015592
H  3.061026 2.571115 -3.336962
H  2.567981 3.230747 -1.781886
H  1.794857 3.791408 -3.262077
H  -2.608579 -0.945747 2.422802
H  -3.547617 0.541989 2.299046
H  -2.439388 0.318478 3.650597
elementType: S O N C H
totalener: -1514.92552841 hartree
nucrepener: 2821.19972935 hartree
electener: -4336.12525775 hartree
oneelecener: -7681.41099995 hartree
twoeener: 3345.28574219 hartree
cpcmener: -0.02624968 hartree
kineticenergy: 1509.09206554 hartree
xcener: -129.014159248804 hartree
chargesum: 0.0000000
charge: 0.016927 -0.353293 -0.306816 -0.479935 -0.137509 -0.169780 0.356847 -0.152008 -0.090160 0.349175 -0.312124 -0.314804 -0.159971 0.013798 -0.165182 -0.203281 -0.098656 -0.085401 -0.111194 -0.134899 -0.103706 -0.065404 0.474930 -0.274434 -0.293378 -0.190390 0.095399 0.098338 0.098643 0.111604 0.099863 0.100620 0.099005 0.106835 0.149234 0.155489 0.145619 0.091246 0.095842 0.106963 0.056026 0.080395 0.074092 0.079224 0.065078 0.071405 0.055775 0.037283 0.071033 0.077438 0.094400 0.079855 0.090830 0.077883 0.082823 0.111036 0.103106 0.128268
qa: 0.0169 -0.3533 -0.3068 -0.4799 -0.1375 -0.1698 0.3568 -0.1520 -0.0902 0.3492 -0.3121 -0.3148 -0.1600 0.0138 -0.1652 -0.2033 -0.0987 -0.0854 -0.1112 -0.1349 -0.1037 -0.0654 0.4749 -0.2744 -0.2934 -0.1904 0.0954 0.0983 0.0986 0.1116 0.0999 0.1006 0.0990 0.1068 0.1492 0.1555 0.1456 0.0912 0.0958 0.1070 0.0560 0.0804 0.0741 0.0792 0.0651 0.0714 0.0558 0.0373 0.0710 0.0774 0.0944 0.0799 0.0908 0.0779 0.0828 0.1110 0.1031 0.1283
va: 2.3446 2.0619 2.0702 2.0386 3.0436 3.1371 3.7262 4.0666 3.7022 3.7928 3.9498 3.9721 3.9441 3.7489 3.8802 3.9782 3.8961 3.9113 3.8299 3.8731 3.9062 3.8693 4.2835 3.9281 3.9588 3.8900 1.0058 1.0034 1.0058 1.0049 1.0003 1.0042 1.0072 0.9995 0.9957 0.9893 1.0006 1.0014 1.0130 0.9954 1.0107 1.0182 1.0078 1.0164 1.0268 1.0046 1.0093 1.0079 1.0067 1.0014 1.0057 0.9998 1.0036 1.0011 1.0007 0.9878 1.0081 0.9987
dispcorr: -0.034532693 hartree
energy: -1514.960061099825
dipole: -13.68030 13.57393 -0.10637 -11.74495 10.63508 -1.10987 -22.35660 20.46328 -1.89332
magnitude: 2.19722 au
magnitude: 5.58490 debye
