program: Orca
programVersion: 5.0.2
elementType: S O O O N N C C C C C C C C C C C C C C C C C C C C H H H H H H H H H H H H H H H H H H H H H H H H H H H H H H H H
charge: 0
multiplicity: 1
keywords: wb97x-d3
keywords: def2-TZVPP
keywords: def2/J RIJCOSX
keywords: DEFGRID2
keywords: scfconv7
keywords: smallprint printgap noloewdin
keywords: NOSOSCF
formula: C20H32N2O3S
InChI: InChI=1/C20H32N2O3S/c1-6-8-13-22(14-9-7-2)26-21(5)19(23)24-17-12-10-11-16-15-20(3,4)25-18(16)17/h10-12H,6-9,13-15H2,1-5H3
58 atoms
S  -2.096232 1.462066 0.948105
O  1.606556 -1.555726 -0.094886
O  0.629748 0.780384 1.247857
O  0.368745 -0.97858 2.623709
N  -2.52013 0.770508 -0.500449
N  -1.432821 0.225186 1.944073
C  2.437363 -2.702955 -0.458896
C  3.875303 -2.13867 -0.527581
C  3.757468 -0.861314 0.246833
C  2.406119 -0.618035 0.434005
C  1.931849 -3.229755 -1.783378
C  2.296205 -3.727672 0.653564
C  4.69908 0.035179 0.715381
C  1.970252 0.508518 1.108307
C  4.265714 1.178551 1.383024
C  2.910501 1.41042 1.582868
C  -3.667375 -0.135827 -0.50314
C  -1.439743 0.394185 -1.410011
C  -4.515421 -0.02457 -1.765057
C  -0.594165 1.568859 -1.870186
C  -5.021963 1.381474 -2.066538
C  0.564875 1.12161 -2.752649
C  -0.107612 -0.071236 1.98375
C  -5.860448 1.988304 -0.950354
C  1.436938 2.28216 -3.204902
C  -2.318773 -0.623196 2.730828
H  4.183094 -1.944165 -1.559315
H  4.598221 -2.835808 -0.101376
H  1.994068 -2.469957 -2.563894
H  0.896275 -3.566008 -1.710467
H  2.535354 -4.081695 -2.098414
H  1.257314 -4.038082 0.77471
H  2.648244 -3.33262 1.608811
H  2.886587 -4.615829 0.424828
H  5.756463 -0.14298 0.564883
H  4.986795 1.892127 1.758486
H  2.575917 2.296906 2.107247
H  -4.282782 0.100794 0.365178
H  -3.337862 -1.175205 -0.375397
H  -1.900623 -0.065489 -2.286606
H  -0.808809 -0.384483 -0.962921
H  -3.966128 -0.406253 -2.629888
H  -5.366423 -0.700795 -1.635557
H  -1.229323 2.27245 -2.417482
H  -0.199957 2.113745 -1.009393
H  -5.616948 1.342733 -2.982751
H  -4.176834 2.038805 -2.2865
H  1.177774 0.398288 -2.20643
H  0.178734 0.590469 -3.628247
H  -5.272058 2.177783 -0.05112
H  -6.68706 1.331651 -0.66937
H  -6.292211 2.942122 -1.257036
H  0.862719 3.013487 -3.777195
H  2.2583 1.942522 -3.837589
H  1.875007 2.80392 -2.35165
H  -3.311028 -0.181501 2.730108
H  -1.982441 -0.69176 3.764993
H  -2.389113 -1.630269 2.317906
elementType: S O N C H
totalener: -1514.92678695 hartree
nucrepener: 2784.91822145 hartree
electener: -4299.84500840 hartree
oneelecener: -7609.08586285 hartree
twoeener: 3309.24085445 hartree
cpcmener: -0.02545207 hartree
kineticenergy: 1509.10332188 hartree
xcener: -129.014854555271 hartree
chargesum: -0.0000000
charge: 0.017450 -0.359866 -0.309101 -0.479803 -0.122959 -0.160588 0.360193 -0.129497 -0.074016 0.277618 -0.304391 -0.325720 -0.184014 0.076827 -0.154590 -0.210967 -0.121366 -0.160983 -0.138348 -0.107092 -0.098030 -0.075302 0.475527 -0.275387 -0.284622 -0.174221 0.089984 0.099928 0.098537 0.101220 0.106233 0.099053 0.109760 0.101388 0.148254 0.155105 0.147155 0.107328 0.112836 0.116166 0.089859 0.076028 0.081461 0.078898 0.064421 0.069511 0.056327 0.031760 0.070356 0.071699 0.081726 0.092970 0.081214 0.090429 0.079354 0.100157 0.115620 0.118513
qa: 0.0174 -0.3599 -0.3091 -0.4798 -0.1230 -0.1606 0.3602 -0.1295 -0.0740 0.2776 -0.3044 -0.3257 -0.1840 0.0768 -0.1546 -0.2110 -0.1214 -0.1610 -0.1383 -0.1071 -0.0980 -0.0753 0.4755 -0.2754 -0.2846 -0.1742 0.0900 0.0999 0.0985 0.1012 0.1062 0.0991 0.1098 0.1014 0.1483 0.1551 0.1472 0.1073 0.1128 0.1162 0.0899 0.0760 0.0815 0.0789 0.0644 0.0695 0.0563 0.0318 0.0704 0.0717 0.0817 0.0930 0.0812 0.0904 0.0794 0.1002 0.1156 0.1185
va: 2.3416 2.0558 2.0796 2.0340 2.9689 3.1702 3.7366 4.0095 3.6757 3.8310 3.9323 3.9744 3.9588 3.7813 3.8762 3.9975 3.8890 3.9468 3.8885 3.8259 3.8712 3.8861 4.2713 3.9282 3.9543 3.8838 1.0087 1.0036 1.0018 1.0062 1.0042 1.0097 0.9989 1.0065 0.9975 0.9897 0.9997 0.9896 1.0004 0.9966 1.0197 1.0123 1.0116 1.0142 1.0276 1.0100 1.0200 1.0162 1.0070 1.0064 1.0019 1.0057 1.0012 1.0038 1.0007 1.0110 0.9999 0.9884
dispcorr: -0.033202848 hartree
energy: -1514.959989793401
dipole: -15.96038 15.90269 -0.05769 -4.79965 3.73541 -1.06425 -24.91763 23.42979 -1.48784
magnitude: 1.83020 au
magnitude: 4.65199 debye
