program: Orca
programVersion: 5.0.2
elementType: S O O O N N C C C C C C C C C C C C C C C C C C C C H H H H H H H H H H H H H H H H H H H H H H H H H H H H H H H H
charge: 0
multiplicity: 1
keywords: wb97x-d3
keywords: def2-TZVPP
keywords: def2/J RIJCOSX
keywords: DEFGRID2
keywords: scfconv7
keywords: smallprint printgap noloewdin
keywords: NOSOSCF
formula: C20H32N2O3S
InChI: InChI=1/C20H32N2O3S/c1-6-8-13-22(14-9-7-2)26-21(5)19(23)24-17-12-10-11-16-15-20(3,4)25-18(16)17/h10-12H,6-9,13-15H2,1-5H3
58 atoms
S  -2.251232 1.875763 0.941738
O  1.487492 -0.550355 -0.49074
O  -0.281428 0.002084 1.683227
O  1.473443 1.389773 1.882342
N  -2.415115 1.308238 -0.601524
N  -0.576118 2.178362 1.264826
C  2.626438 -1.029008 -1.272812
C  2.823843 -2.491754 -0.81539
C  2.105893 -2.515821 0.500116
C  1.350737 -1.357038 0.573373
C  3.821971 -0.166015 -0.903877
C  2.26607 -0.897089 -2.736322
C  2.051763 -3.448331 1.519254
C  0.533509 -1.102377 1.661027
C  1.230795 -3.197983 2.616374
C  0.477155 -2.032325 2.687613
C  -2.203712 -0.110611 -0.885301
C  -2.11408 2.203587 -1.712429
C  -2.968046 -1.051967 0.028887
C  -0.672176 2.149883 -2.212545
C  -2.640908 -2.509012 -0.274919
C  -0.394943 3.209472 -3.271068
C  0.304627 1.215282 1.630056
C  -3.335649 -3.471833 0.67487
C  1.018002 3.118918 -3.827453
C  -0.129147 3.562023 1.214579
H  3.88145 -2.747627 -0.738132
H  2.369919 -3.197523 -1.517584
H  4.070532 -0.253269 0.155823
H  3.631887 0.88556 -1.124644
H  4.697765 -0.475062 -1.476041
H  1.355403 -1.449519 -2.972882
H  3.070361 -1.298558 -3.353691
H  2.121832 0.146849 -3.020422
H  2.633425 -4.36002 1.466766
H  1.176738 -3.91353 3.425958
H  -0.16226 -1.841687 3.540623
H  -1.140494 -0.367424 -0.878523
H  -2.544679 -0.266979 -1.913447
H  -2.365733 3.219788 -1.400826
H  -2.788992 1.952704 -2.538146
H  -2.726262 -0.846011 1.073047
H  -4.042484 -0.876542 -0.082226
H  0.020558 2.281452 -1.376583
H  -0.462666 1.160627 -2.631249
H  -1.558015 -2.656179 -0.208951
H  -2.91772 -2.745366 -1.306864
H  -1.116269 3.111943 -4.088544
H  -0.556682 4.202819 -2.840967
H  -4.421812 -3.376792 0.617462
H  -3.043496 -3.283174 1.710105
H  -3.08471 -4.509121 0.448467
H  1.763142 3.212185 -3.034606
H  1.214062 3.90684 -4.55626
H  1.187384 2.162483 -4.326206
H  -0.408124 4.099911 2.122364
H  -0.586327 4.063423 0.364235
H  0.95027 3.61844 1.098856
elementType: S O N C H
totalener: -1514.92485130 hartree
nucrepener: 2849.83054810 hartree
electener: -4364.75539939 hartree
oneelecener: -7738.68301857 hartree
twoeener: 3373.92761917 hartree
cpcmener: -0.02538588 hartree
kineticenergy: 1509.09900483 hartree
xcener: -129.015780318493 hartree
chargesum: -0.0000000
charge: 0.018107 -0.360126 -0.308798 -0.480006 -0.133547 -0.160689 0.367305 -0.127454 -0.110670 0.340040 -0.328037 -0.312944 -0.172647 0.051268 -0.149206 -0.220887 -0.097609 -0.098637 -0.125290 -0.107050 -0.085261 -0.078620 0.456631 -0.290382 -0.287635 -0.190804 0.099612 0.090425 0.110575 0.099168 0.102432 0.100956 0.113508 0.089178 0.148032 0.155111 0.144657 0.055666 0.109942 0.094864 0.093293 0.066803 0.081407 0.060072 0.069796 0.052462 0.069909 0.060461 0.059454 0.081930 0.079022 0.090712 0.082345 0.099698 0.077427 0.131848 0.107613 0.114569
qa: 0.0181 -0.3601 -0.3088 -0.4800 -0.1335 -0.1607 0.3673 -0.1275 -0.1107 0.3400 -0.3280 -0.3129 -0.1726 0.0513 -0.1492 -0.2209 -0.0976 -0.0986 -0.1253 -0.1070 -0.0853 -0.0786 0.4566 -0.2904 -0.2876 -0.1908 0.0996 0.0904 0.1106 0.0992 0.1024 0.1010 0.1135 0.0892 0.1480 0.1551 0.1447 0.0557 0.1099 0.0949 0.0933 0.0668 0.0814 0.0601 0.0698 0.0525 0.0699 0.0605 0.0595 0.0819 0.0790 0.0907 0.0823 0.0997 0.0774 0.1318 0.1076 0.1146
va: 2.3248 2.0672 2.0549 2.0358 3.0295 3.1310 3.7291 4.0126 3.6964 3.8006 3.9780 3.9302 3.9512 3.7317 3.8673 3.9844 3.9085 3.9243 3.8576 3.7944 3.8718 3.8829 4.2993 3.9526 3.9380 3.8840 1.0033 1.0084 0.9987 1.0080 1.0062 1.0047 1.0068 1.0059 0.9973 0.9891 1.0020 1.0069 0.9957 1.0106 1.0013 1.0275 1.0162 1.0100 1.0108 1.0053 1.0075 1.0085 1.0074 1.0006 1.0010 1.0039 0.9995 1.0058 0.9995 0.9932 0.9959 1.0118
dispcorr: -0.035425354 hartree
energy: -1514.960276652245
dipole: 0.06309 0.17052 0.23361 -0.65760 0.03717 -0.62043 -27.63286 25.61854 -2.01432
magnitude: 2.12061 au
magnitude: 5.39016 debye
