program: Orca
programVersion: 5.0.2
elementType: S O O O N N C C C C C C C C C C C C C C C C C C C C H H H H H H H H H H H H H H H H H H H H H H H H H H H H H H H H
charge: 0
multiplicity: 1
keywords: wb97x-d3
keywords: def2-TZVPP
keywords: def2/J RIJCOSX
keywords: DEFGRID2
keywords: scfconv7
keywords: smallprint printgap noloewdin
keywords: NOSOSCF
formula: C20H32N2O3S
InChI: InChI=1/C20H32N2O3S/c1-6-8-13-22(14-9-7-2)26-21(5)19(23)24-17-12-10-11-16-15-20(3,4)25-18(16)17/h10-12H,6-9,13-15H2,1-5H3
58 atoms
S  -2.289425 0.107411 0.539306
O  1.949268 -2.451527 1.10392
O  0.523993 -0.101194 0.361305
O  0.634632 -1.318419 -1.52627
N  -2.669546 1.574657 -0.095394
N  -1.379977 -0.776822 -0.626988
C  2.984235 -3.484364 1.159916
C  4.301619 -2.706747 1.384896
C  3.930909 -1.318662 0.959338
C  2.551046 -1.283699 0.837117
C  2.977925 -4.192307 -0.184548
C  2.637112 -4.42079 2.296334
C  4.679989 -0.181918 0.721656
C  1.896712 -0.126895 0.4553
C  4.024737 0.991255 0.352781
C  2.642269 1.016313 0.213631
C  -3.834197 1.735117 -0.959216
C  -1.720368 2.676239 -0.04115
C  -4.956606 2.527731 -0.298453
C  -0.853331 2.84545 -1.284192
C  -5.535635 1.88154 0.955032
C  0.132475 3.997077 -1.134491
C  -0.022877 -0.775842 -0.669618
C  -6.199884 0.534751 0.705638
C  1.021189 4.168212 -2.356332
C  -2.075823 -1.433462 -1.725147
H  5.121102 -3.131617 0.803315
H  4.606443 -2.726188 2.435641
H  3.716842 -4.99473 -0.191529
H  3.222824 -3.507752 -0.999253
H  2.002088 -4.633707 -0.391999
H  2.597404 -3.892311 3.250047
H  3.39444 -5.201267 2.379436
H  1.675181 -4.909377 2.132283
H  5.758168 -0.198169 0.820028
H  4.593396 1.891162 0.160554
H  2.136539 1.927551 -0.082592
H  -4.194316 0.748517 -1.251142
H  -3.538777 2.230781 -1.88914
H  -1.086152 2.534436 0.83605
H  -2.280489 3.6009 0.133701
H  -4.598318 3.533468 -0.05889
H  -5.749933 2.66145 -1.041249
H  -0.303546 1.922419 -1.485808
H  -1.484785 3.024179 -2.159747
H  -6.268915 2.566107 1.390271
H  -4.749804 1.771306 1.707987
H  -0.415317 4.926033 -0.947669
H  0.754535 3.831168 -0.249291
H  -5.485965 -0.221582 0.375634
H  -6.977067 0.609576 -0.058435
H  -6.67055 0.155005 1.613872
H  1.721191 4.995612 -2.230967
H  0.430536 4.371499 -3.251816
H  1.60806 3.268033 -2.549923
H  -3.119074 -1.562659 -1.446369
H  -1.656788 -2.419985 -1.922588
H  -2.033316 -0.844757 -2.644042
elementType: S O N C H
totalener: -1514.92518194 hartree
nucrepener: 2705.57221135 hartree
electener: -4220.49739330 hartree
oneelecener: -7450.47052434 hartree
twoeener: 3229.97313104 hartree
cpcmener: -0.02770086 hartree
kineticenergy: 1509.09230849 hartree
xcener: -129.015955436972 hartree
chargesum: 0.0000000
charge: 0.022070 -0.367180 -0.316303 -0.484404 -0.143640 -0.143704 0.372351 -0.116772 -0.114884 0.281726 -0.329041 -0.293418 -0.175284 0.049559 -0.202640 -0.131152 -0.105877 -0.097130 -0.120392 -0.125917 -0.113710 -0.114722 0.463916 -0.265333 -0.272932 -0.186048 0.098630 0.090318 0.101193 0.109938 0.099778 0.096229 0.098704 0.099934 0.149319 0.151180 0.147449 0.097355 0.108482 0.093903 0.097727 0.073030 0.073586 0.054394 0.083064 0.072759 0.056539 0.082164 0.064100 0.068023 0.080916 0.092295 0.091824 0.082618 0.076915 0.101479 0.115185 0.121830
qa: 0.0221 -0.3672 -0.3163 -0.4844 -0.1436 -0.1437 0.3724 -0.1168 -0.1149 0.2817 -0.3290 -0.2934 -0.1753 0.0496 -0.2026 -0.1312 -0.1059 -0.0971 -0.1204 -0.1259 -0.1137 -0.1147 0.4639 -0.2653 -0.2729 -0.1860 0.0986 0.0903 0.1012 0.1099 0.0998 0.0962 0.0987 0.0999 0.1493 0.1512 0.1474 0.0974 0.1085 0.0939 0.0977 0.0730 0.0736 0.0544 0.0831 0.0728 0.0565 0.0822 0.0641 0.0680 0.0809 0.0923 0.0918 0.0826 0.0769 0.1015 0.1152 0.1218
va: 2.3794 2.0985 2.0957 2.0275 3.0181 3.1800 3.6978 3.9809 3.6680 3.9097 3.9767 3.9442 3.9311 3.9167 3.9366 3.9168 3.9173 3.9076 3.8674 3.8124 3.8781 3.8825 4.2665 3.9202 3.9376 3.8967 1.0034 1.0090 1.0065 0.9989 1.0090 1.0059 1.0027 1.0064 0.9983 0.9943 0.9855 0.9913 1.0062 1.0156 0.9968 1.0113 1.0145 1.0153 1.0165 1.0113 1.0172 1.0049 0.9996 1.0126 1.0028 1.0048 1.0039 1.0018 1.0020 1.0067 1.0018 0.9857
dispcorr: -0.031406484 hartree
energy: -1514.956588425517
dipole: -16.53197 16.42383 -0.10814 11.93961 -11.42351 0.51610 -7.67657 7.66817 -0.00840
magnitude: 0.52738 au
magnitude: 1.34049 debye
