program: Orca
programVersion: 5.0.2
elementType: S O O O N N C C C C C C C C C C C C C C C C C C C C H H H H H H H H H H H H H H H H H H H H H H H H H H H H H H H H
charge: 0
multiplicity: 1
keywords: wb97x-d3
keywords: def2-TZVPP
keywords: def2/J RIJCOSX
keywords: DEFGRID2
keywords: scfconv7
keywords: smallprint printgap noloewdin
keywords: NOSOSCF
formula: C20H32N2O3S
InChI: InChI=1/C20H32N2O3S/c1-6-8-13-22(14-9-7-2)26-21(5)19(23)24-17-12-10-11-16-15-20(3,4)25-18(16)17/h10-12H,6-9,13-15H2,1-5H3
58 atoms
S  -1.545439 2.60589 0.781437
O  0.868369 -1.340281 0.059054
O  0.991914 1.35475 0.992988
O  0.560789 0.059718 2.780041
N  -2.004189 1.750579 -0.553774
N  -1.002332 1.516573 2.009067
C  1.192936 -2.746501 -0.174846
C  2.679518 -2.738224 -0.598592
C  3.147589 -1.403657 -0.102697
C  2.019605 -0.673827 0.234543
C  0.260899 -3.260235 -1.250119
C  0.993802 -3.475299 1.142945
C  4.403595 -0.840074 0.019845
C  2.120074 0.622116 0.709424
C  4.511118 0.467132 0.489584
C  3.377088 1.192408 0.83544
C  -0.991969 1.407846 -1.551199
C  -3.170503 0.878778 -0.464108
C  -1.52972 1.45948 -2.974087
C  -2.851236 -0.591344 -0.208922
C  -0.488458 1.026089 -4.003079
C  -4.111308 -1.409808 0.03842
C  0.20645 0.903912 1.991528
C  0.776107 1.874438 -4.012635
C  -3.816275 -2.886755 0.250518
C  -1.945887 1.093815 3.035739
H  2.789072 -2.811558 -1.684782
H  3.224127 -3.576409 -0.161574
H  0.499823 -4.29858 -1.482581
H  0.357432 -2.681925 -2.170288
H  -0.781075 -3.226163 -0.926725
H  1.660725 -3.09229 1.91814
H  1.203362 -4.538735 1.020378
H  -0.03349 -3.373957 1.496427
H  5.290867 -1.400992 -0.245572
H  5.485358 0.925127 0.595847
H  3.464113 2.205984 1.206596
H  -0.561931 0.41836 -1.362712
H  -0.181946 2.128145 -1.445176
H  -3.752354 0.96454 -1.386801
H  -3.809189 1.264762 0.332864
H  -2.401628 0.807985 -3.075769
H  -1.872481 2.475524 -3.193297
H  -2.314469 -1.010876 -1.06567
H  -2.180309 -0.686942 0.650169
H  -0.948869 1.056491 -4.993734
H  -0.221251 -0.020737 -3.82776
H  -4.635893 -1.012874 0.913017
H  -4.797561 -1.292363 -0.806191
H  1.359076 1.755699 -3.09805
H  0.542762 2.936173 -4.11957
H  1.426215 1.597538 -4.843949
H  -3.146253 -3.040095 1.099089
H  -3.340621 -3.32706 -0.628208
H  -4.727941 -3.453162 0.447036
H  -2.759965 1.813101 3.078224
H  -1.470654 1.069156 4.015879
H  -2.366656 0.107632 2.82726
elementType: S O N C H
totalener: -1514.92466641 hartree
nucrepener: 2834.40956343 hartree
electener: -4349.33422984 hartree
oneelecener: -7707.75425431 hartree
twoeener: 3358.42002446 hartree
cpcmener: -0.02581920 hartree
kineticenergy: 1509.09119135 hartree
xcener: -129.014904485936 hartree
chargesum: 0.0000000
charge: 0.013167 -0.361989 -0.318022 -0.479249 -0.133502 -0.164301 0.362403 -0.122532 -0.106791 0.311794 -0.305466 -0.328193 -0.188829 0.087323 -0.150740 -0.211523 -0.096312 -0.120670 -0.099767 -0.104016 -0.109497 -0.082884 0.467607 -0.275857 -0.288656 -0.166429 0.090511 0.099243 0.113394 0.099416 0.085674 0.110959 0.103309 0.097572 0.148572 0.154859 0.146779 0.055452 0.099043 0.104003 0.097357 0.075509 0.071397 0.070879 0.054402 0.071882 0.056045 0.060603 0.063842 0.079082 0.082004 0.092253 0.081514 0.079776 0.099788 0.101812 0.116287 0.109711
qa: 0.0132 -0.3620 -0.3180 -0.4792 -0.1335 -0.1643 0.3624 -0.1225 -0.1068 0.3118 -0.3055 -0.3282 -0.1888 0.0873 -0.1507 -0.2115 -0.0963 -0.1207 -0.0998 -0.1040 -0.1095 -0.0829 0.4676 -0.2759 -0.2887 -0.1664 0.0905 0.0992 0.1134 0.0994 0.0857 0.1110 0.1033 0.0976 0.1486 0.1549 0.1468 0.0555 0.0990 0.1040 0.0974 0.0755 0.0714 0.0709 0.0544 0.0719 0.0560 0.0606 0.0638 0.0791 0.0820 0.0923 0.0815 0.0798 0.0998 0.1018 0.1163 0.1097
va: 2.3374 2.0702 2.0795 2.0317 3.0639 3.1514 3.7303 3.9968 3.6851 3.8552 3.9350 3.9823 3.9541 3.7856 3.8755 4.0114 3.9400 3.9425 3.8468 3.7905 3.8990 3.8798 4.2873 3.9347 3.9371 3.8842 1.0079 1.0040 1.0070 1.0046 1.0074 0.9991 1.0063 1.0076 0.9978 0.9897 1.0003 1.0126 1.0111 0.9906 1.0125 1.0141 1.0170 1.0063 1.0130 1.0073 1.0094 1.0070 1.0082 0.9961 1.0014 1.0047 0.9998 0.9984 1.0059 1.0128 1.0020 0.9853
dispcorr: -0.034894836 hartree
energy: -1514.959561243231
dipole: -18.50491 17.99148 -0.51343 -20.03389 18.62173 -1.41216 -20.09403 18.59439 -1.49963
magnitude: 2.12290 au
magnitude: 5.39598 debye
