program: Orca
programVersion: 5.0.2
elementType: S O O O N N C C C C C C C C C C C C C C C C C C C C H H H H H H H H H H H H H H H H H H H H H H H H H H H H H H H H
charge: 0
multiplicity: 1
keywords: wb97x-d3
keywords: def2-TZVPP
keywords: def2/J RIJCOSX
keywords: DEFGRID2
keywords: scfconv7
keywords: smallprint printgap noloewdin
keywords: NOSOSCF
formula: C20H32N2O3S
InChI: InChI=1/C20H32N2O3S/c1-6-8-13-22(14-9-7-2)26-21(5)19(23)24-17-12-10-11-16-15-20(3,4)25-18(16)17/h10-12H,6-9,13-15H2,1-5H3
58 atoms
S  -1.456644 1.938922 0.74047
O  1.96774 -1.30141 -0.210248
O  0.380714 0.018469 1.757202
O  2.255359 1.236998 1.528475
N  -1.700848 1.463065 -0.827044
N  0.238925 2.127176 0.986575
C  3.057419 -2.041939 -0.845248
C  3.244333 -3.295473 0.039808
C  2.584478 -2.88258 1.32072
C  1.864346 -1.72899 1.05614
C  4.285437 -1.148968 -0.807506
C  2.628585 -2.359944 -2.260194
C  2.563013 -3.440389 2.584699
C  1.127649 -1.100908 2.043824
C  1.815188 -2.818325 3.582107
C  1.104388 -1.654315 3.314462
C  -1.441945 0.067126 -1.175051
C  -1.424315 2.427792 -1.890462
C  -2.248427 -0.931663 -0.359684
C  -2.466266 2.414652 -3.000799
C  -3.761497 -0.76401 -0.452892
C  -3.857802 2.820913 -2.538019
C  1.055999 1.134386 1.421796
C  -4.3260 -0.986417 -1.847921
C  -4.877159 2.7919 -3.665791
C  0.878575 3.38871 0.63269
H  4.299308 -3.546429 0.158758
H  2.749304 -4.17047 -0.391563
H  4.582115 -0.917444 0.217479
H  4.105045 -0.208705 -1.330653
H  5.127074 -1.645543 -1.291927
H  3.407943 -2.930936 -2.765644
H  2.456784 -1.45048 -2.838212
H  1.71502 -2.955753 -2.274931
H  3.118067 -4.344673 2.800184
H  1.788967 -3.238056 4.578621
H  0.528874 -1.170625 4.093796
H  -0.373092 -0.164141 -1.096364
H  -1.690702 -0.049396 -2.231073
H  -0.427231 2.249706 -2.312916
H  -1.400859 3.423866 -1.445202
H  -1.96987 -1.930269 -0.710708
H  -1.942796 -0.887102 0.687183
H  -2.121838 3.107195 -3.775406
H  -2.505557 1.432317 -3.481884
H  -4.045753 0.229045 -0.094775
H  -4.228507 -1.472806 0.236171
H  -4.188015 2.160341 -1.732281
H  -3.814882 3.826537 -2.107615
H  -4.075935 -1.981719 -2.222144
H  -3.94533 -0.261852 -2.569972
H  -5.413777 -0.900372 -1.850828
H  -5.865579 3.097918 -3.319593
H  -4.975042 1.789171 -4.08751
H  -4.592684 3.461996 -4.479827
H  1.470518 3.301555 -0.278945
H  1.523655 3.740836 1.436664
H  0.106426 4.13518 0.47235
elementType: S O N C H
totalener: -1514.92598829 hartree
nucrepener: 2759.51712507 hartree
electener: -4274.44311336 hartree
oneelecener: -7558.23851809 hartree
twoeener: 3283.79540473 hartree
cpcmener: -0.02574164 hartree
kineticenergy: 1509.10908244 hartree
xcener: -129.017677676720 hartree
chargesum: 0.0000000
charge: 0.012822 -0.365980 -0.316367 -0.482106 -0.127913 -0.159425 0.357226 -0.120943 -0.085590 0.299098 -0.326830 -0.303403 -0.192745 0.079779 -0.150072 -0.209513 -0.163019 -0.098595 -0.124728 -0.131008 -0.114814 -0.107988 0.472159 -0.276948 -0.276024 -0.176868 0.099417 0.089224 0.109906 0.099253 0.101088 0.104712 0.100480 0.097135 0.148487 0.154439 0.146617 0.103361 0.119956 0.110142 0.096462 0.078411 0.076345 0.084298 0.067647 0.057385 0.078007 0.059886 0.069216 0.088567 0.068271 0.096838 0.090467 0.076319 0.082434 0.119779 0.115424 0.099825
qa: 0.0128 -0.3660 -0.3164 -0.4821 -0.1279 -0.1594 0.3572 -0.1209 -0.0856 0.2991 -0.3268 -0.3034 -0.1927 0.0798 -0.1501 -0.2095 -0.1630 -0.0986 -0.1247 -0.1310 -0.1148 -0.1080 0.4722 -0.2769 -0.2760 -0.1769 0.0994 0.0892 0.1099 0.0993 0.1011 0.1047 0.1005 0.0971 0.1485 0.1544 0.1466 0.1034 0.1200 0.1101 0.0965 0.0784 0.0763 0.0843 0.0676 0.0574 0.0780 0.0599 0.0692 0.0886 0.0683 0.0968 0.0905 0.0763 0.0824 0.1198 0.1154 0.0998
va: 2.3501 2.0733 2.0762 2.0300 2.9554 3.1791 3.7438 3.9918 3.6757 3.8621 3.9743 3.9276 3.9605 3.7760 3.8721 4.0128 3.9218 3.9123 3.8471 3.8721 3.8867 3.8597 4.2786 3.9279 3.9462 3.8828 1.0038 1.0086 0.9989 1.0091 1.0064 1.0038 1.0058 1.0063 0.9978 0.9900 0.9998 1.0239 0.9872 0.9992 1.0028 1.0149 1.0288 1.0154 1.0077 1.0146 1.0104 1.0107 1.0104 1.0056 0.9980 1.0036 1.0040 1.0002 1.0007 0.9870 1.0009 1.0118
dispcorr: -0.032937860 hartree
energy: -1514.958926147426
dipole: -19.80762 19.93580 0.12818 2.21305 -2.94234 -0.72929 -32.41016 30.72762 -1.68253
magnitude: 1.83827 au
magnitude: 4.67250 debye
