program: Orca
programVersion: 5.0.2
elementType: S O O O N N C C C C C C C C C C C C C C C C C C C C H H H H H H H H H H H H H H H H H H H H H H H H H H H H H H H H
charge: 0
multiplicity: 1
keywords: wb97x-d3
keywords: def2-TZVPP
keywords: def2/J RIJCOSX
keywords: DEFGRID2
keywords: scfconv7
keywords: smallprint printgap noloewdin
keywords: NOSOSCF
formula: C20H32N2O3S
InChI: InChI=1/C20H32N2O3S/c1-6-8-13-22(14-9-7-2)26-21(5)19(23)24-17-12-10-11-16-15-20(3,4)25-18(16)17/h10-12H,6-9,13-15H2,1-5H3
58 atoms
S  -1.439436 2.301796 0.930412
O  1.025396 -1.603728 0.089403
O  0.959392 0.883982 1.482108
O  0.095794 -0.676373 2.85202
N  -1.554032 1.716217 -0.602563
N  -1.213399 0.989589 2.035244
C  1.369581 -2.975996 -0.278357
C  2.914669 -2.985673 -0.338808
C  3.273435 -1.774412 0.467853
C  2.110354 -1.043489 0.64556
C  0.711464 -3.274029 -1.607055
C  0.850552 -3.8784 0.828351
C  4.471433 -1.309534 0.976815
C  2.113446 0.149149 1.346955
C  4.483884 -0.101429 1.67081
C  3.311632 0.62105 1.859526
C  -2.717058 0.927189 -0.988647
C  -0.348822 1.561834 -1.41284
C  -2.502429 -0.583554 -0.918969
C  -0.542935 2.026964 -2.850205
C  -3.792643 -1.376596 -1.104602
C  -0.969934 3.482731 -2.97255
C  -0.046008 0.316747 2.178256
C  -4.449319 -1.188808 -2.465487
C  -1.046689 3.952084 -4.416954
C  -2.373797 0.443755 2.725916
H  3.2777 -2.891808 -1.366745
H  3.324579 -3.9121 0.065927
H  -0.376795 -3.235866 -1.532566
H  0.983934 -4.276552 -1.93875
H  1.03165 -2.56963 -2.376225
H  1.060583 -4.922609 0.593516
H  -0.22889 -3.772285 0.947753
H  1.323629 -3.65229 1.786221
H  5.387009 -1.870831 0.838816
H  5.411046 0.278438 2.078568
H  3.323088 1.554642 2.408168
H  -3.011689 1.216043 -2.001612
H  -3.544259 1.215096 -0.335942
H  0.004173 0.525648 -1.409196
H  0.435997 2.163365 -0.95399
H  -1.779485 -0.893157 -1.680443
H  -2.060264 -0.843637 0.046591
H  0.414428 1.882124 -3.36093
H  -1.255326 1.382336 -3.375026
H  -4.500668 -1.105287 -0.314984
H  -3.571131 -2.437081 -0.958597
H  -1.941391 3.626768 -2.492734
H  -0.264248 4.111949 -2.42074
H  -4.800316 -0.167163 -2.61875
H  -5.314598 -1.84404 -2.577603
H  -3.75508 -1.422857 -3.27573
H  -1.768206 3.364952 -4.988991
H  -0.08078 3.862431 -4.918487
H  -1.352898 4.997377 -4.481505
H  -3.198417 1.141482 2.620169
H  -2.174398 0.321548 3.789203
H  -2.682046 -0.517987 2.31434
elementType: S O N C H
totalener: -1514.92470079 hartree
nucrepener: 2792.20940111 hartree
electener: -4307.13410189 hartree
oneelecener: -7623.43225364 hartree
twoeener: 3316.29815175 hartree
cpcmener: -0.02571803 hartree
kineticenergy: 1509.09736457 hartree
xcener: -129.016442893131 hartree
chargesum: -0.0000000
charge: 0.010877 -0.364296 -0.318798 -0.479932 -0.135708 -0.162377 0.363716 -0.118426 -0.101163 0.297828 -0.318270 -0.331030 -0.192834 0.097386 -0.147961 -0.214850 -0.119555 -0.101306 -0.124808 -0.117792 -0.105532 -0.081349 0.468295 -0.276262 -0.282229 -0.165867 0.090099 0.099241 0.097727 0.112831 0.100770 0.103068 0.099630 0.110570 0.148151 0.154022 0.146777 0.105757 0.101111 0.085311 0.099326 0.074692 0.070273 0.080600 0.070620 0.060435 0.070258 0.056675 0.058413 0.080422 0.092776 0.081437 0.078878 0.078011 0.089477 0.098804 0.118036 0.108044
qa: 0.0109 -0.3643 -0.3188 -0.4799 -0.1357 -0.1624 0.3637 -0.1184 -0.1012 0.2978 -0.3183 -0.3310 -0.1928 0.0974 -0.1480 -0.2149 -0.1196 -0.1013 -0.1248 -0.1178 -0.1055 -0.0813 0.4683 -0.2763 -0.2822 -0.1659 0.0901 0.0992 0.0977 0.1128 0.1008 0.1031 0.0996 0.1106 0.1482 0.1540 0.1468 0.1058 0.1011 0.0853 0.0993 0.0747 0.0703 0.0806 0.0706 0.0604 0.0703 0.0567 0.0584 0.0804 0.0928 0.0814 0.0789 0.0780 0.0895 0.0988 0.1180 0.1080
va: 2.3519 2.0723 2.0812 2.0310 3.0258 3.1534 3.7265 3.9896 3.6773 3.8667 3.9300 3.9802 3.9567 3.7884 3.8730 4.0138 3.9219 3.9102 3.8344 3.8616 3.9103 3.8618 4.2846 3.9334 3.9531 3.8856 1.0081 1.0039 1.0024 1.0054 1.0044 1.0067 1.0068 0.9990 0.9981 0.9900 1.0004 0.9833 1.0111 1.0200 1.0147 1.0070 1.0186 1.0115 1.0019 1.0078 1.0066 1.0139 1.0093 0.9988 1.0053 0.9996 1.0004 1.0007 1.0037 1.0146 0.9990 0.9880
dispcorr: -0.033652158 hartree
energy: -1514.958352943921
dipole: -20.95207 20.79012 -0.16194 -7.94154 6.89236 -1.04918 -30.55114 28.80802 -1.74312
magnitude: 2.04095 au
magnitude: 5.18768 debye
