program: Orca
programVersion: 5.0.2
elementType: S O O O N N C C C C C C C C C C C C C C C C C C C C H H H H H H H H H H H H H H H H H H H H H H H H H H H H H H H H
charge: 0
multiplicity: 1
keywords: wb97x-d3
keywords: def2-TZVPP
keywords: def2/J RIJCOSX
keywords: DEFGRID2
keywords: scfconv7
keywords: smallprint printgap noloewdin
keywords: NOSOSCF
formula: C20H32N2O3S
InChI: InChI=1/C20H32N2O3S/c1-6-8-13-22(14-9-7-2)26-21(5)19(23)24-17-12-10-11-16-15-20(3,4)25-18(16)17/h10-12H,6-9,13-15H2,1-5H3
58 atoms
S  -1.497034 2.493828 0.684641
O  0.693683 -1.671426 0.126496
O  0.787956 0.936425 1.25821
O  -0.108023 -0.40315 2.825656
N  -1.820441 1.899095 -0.822485
N  -1.370709 1.190962 1.813533
C  0.990375 -3.018022 -0.363035
C  2.535391 -3.144596 -0.312157
C  2.959324 -1.87906 0.367743
C  1.826555 -1.108968 0.565256
C  0.441931 -3.113116 -1.772208
C  0.311115 -3.992589 0.579987
C  4.199146 -1.404978 0.75553
C  1.904326 0.142374 1.153646
C  4.28485 -0.146804 1.346398
C  3.143407 0.62106 1.547855
C  -0.739379 1.335172 -1.628992
C  -3.143464 1.346569 -1.096026
C  0.45272 2.259275 -1.804615
C  -3.282828 -0.151383 -0.837378
C  1.576304 1.577188 -2.576271
C  -4.718668 -0.649019 -0.97445
C  -0.225372 0.49754 2.028793
C  2.800875 2.464118 -2.734578
C  -5.303555 -0.487382 -2.371096
C  -2.527642 0.812867 2.615334
H  2.965193 -3.223978 -1.313992
H  2.843776 -4.03622 0.237544
H  0.907308 -2.375973 -2.428741
H  -0.638249 -2.957697 -1.791432
H  0.64316 -4.101732 -2.186384
H  0.486428 -5.01751 0.25045
H  -0.767706 -3.830697 0.608782
H  0.699854 -3.897561 1.595593
H  5.09164 -1.997235 0.596904
H  5.246114 0.241595 1.654999
H  3.213043 1.600792 2.003907
H  -1.169085 1.129826 -2.61379
H  -0.41031 0.367764 -1.235395
H  -3.374547 1.565135 -2.1430
H  -3.868511 1.898129 -0.492806
H  0.134736 3.165713 -2.328955
H  0.832097 2.579716 -0.832385
H  -2.642479 -0.708847 -1.528448
H  -2.920957 -0.382979 0.167069
H  1.215139 1.269935 -3.562708
H  1.862202 0.657186 -2.056139
H  -4.746072 -1.705691 -0.696195
H  -5.353624 -0.130748 -0.248899
H  3.213474 2.74417 -1.763005
H  2.560792 3.386237 -3.267851
H  3.591148 1.95936 -3.292251
H  -6.291511 -0.94554 -2.438417
H  -4.670755 -0.963636 -3.123411
H  -5.416859 0.560291 -2.653694
H  -3.38886 1.378298 2.269489
H  -2.372643 1.040862 3.671463
H  -2.755608 -0.249215 2.517354
elementType: S O N C H
totalener: -1514.92522035 hartree
nucrepener: 2821.13751629 hartree
electener: -4336.06273664 hartree
oneelecener: -7681.28580521 hartree
twoeener: 3345.22306857 hartree
cpcmener: -0.02613987 hartree
kineticenergy: 1509.09231766 hartree
xcener: -129.013748151593 hartree
chargesum: 0.0000000
charge: 0.015802 -0.355396 -0.309100 -0.479013 -0.138467 -0.171437 0.357984 -0.153016 -0.099443 0.361743 -0.313708 -0.316967 -0.157294 0.011825 -0.164444 -0.201306 -0.081043 -0.100698 -0.131621 -0.110647 -0.072653 -0.110602 0.472640 -0.291291 -0.274756 -0.186991 0.095000 0.098800 0.101055 0.097702 0.112138 0.101519 0.099024 0.107147 0.148646 0.154271 0.145756 0.107107 0.047978 0.096156 0.097303 0.080359 0.066111 0.073386 0.080534 0.069017 0.044837 0.070146 0.059172 0.078929 0.081951 0.090336 0.092550 0.080813 0.079869 0.105525 0.126196 0.110565
qa: 0.0158 -0.3554 -0.3091 -0.4790 -0.1385 -0.1714 0.3580 -0.1530 -0.0994 0.3617 -0.3137 -0.3170 -0.1573 0.0118 -0.1644 -0.2013 -0.0810 -0.1007 -0.1316 -0.1106 -0.0727 -0.1106 0.4726 -0.2913 -0.2748 -0.1870 0.0950 0.0988 0.1011 0.0977 0.1121 0.1015 0.0990 0.1071 0.1486 0.1543 0.1458 0.1071 0.0480 0.0962 0.0973 0.0804 0.0661 0.0734 0.0805 0.0690 0.0448 0.0701 0.0592 0.0789 0.0820 0.0903 0.0926 0.0808 0.0799 0.1055 0.1262 0.1106
va: 2.3444 2.0612 2.0685 2.0395 3.0385 3.1382 3.7226 4.0670 3.7090 3.7868 3.9474 3.9738 3.9414 3.7487 3.8802 3.9761 3.9115 3.8991 3.8677 3.8173 3.8707 3.9117 4.2865 3.9572 3.9340 3.8867 1.0058 1.0031 1.0011 1.0059 1.0049 1.0043 1.0069 0.9994 0.9959 0.9897 1.0004 0.9957 1.0121 0.9971 1.0110 1.0160 1.0272 1.0139 1.0127 1.0068 1.0067 1.0057 1.0073 1.0010 1.0005 1.0038 1.0048 0.9998 0.9989 1.0083 0.9972 0.9897
dispcorr: -0.034193487 hartree
energy: -1514.959413837715
dipole: -14.58981 14.25348 -0.33633 -10.16747 8.98348 -1.18399 -25.56187 23.76373 -1.79814
magnitude: 2.17904 au
magnitude: 5.53869 debye
