program: Orca
programVersion: 5.0.2
elementType: S O O O N N C C C C C C C C C C C C C C C C C C C C H H H H H H H H H H H H H H H H H H H H H H H H H H H H H H H H
charge: 0
multiplicity: 1
keywords: wb97x-d3
keywords: def2-TZVPP
keywords: def2/J RIJCOSX
keywords: DEFGRID2
keywords: scfconv7
keywords: smallprint printgap noloewdin
keywords: NOSOSCF
formula: C20H32N2O3S
InChI: InChI=1/C20H32N2O3S/c1-6-8-13-22(14-9-7-2)26-21(5)19(23)24-17-12-10-11-16-15-20(3,4)25-18(16)17/h10-12H,6-9,13-15H2,1-5H3
58 atoms
S  -0.485346 1.607158 -1.536477
O  2.50739 -1.970463 -0.234356
O  0.430052 -0.163252 0.460694
O  -0.650673 -2.012965 -0.220376
N  -1.66245 2.498771 -0.80144
N  -0.86238 -0.068073 -1.375257
C  3.436684 -3.100251 -0.236294
C  3.896691 -3.238208 1.234548
C  2.855537 -2.4552 1.974446
C  2.127363 -1.74879 1.031414
C  4.563183 -2.761596 -1.187945
C  2.655504 -4.321566 -0.689491
C  2.571227 -2.315922 3.320011
C  1.104095 -0.898278 1.408645
C  1.544537 -1.456948 3.706418
C  0.812713 -0.755041 2.755925
C  -1.635232 2.682381 0.644215
C  -2.969123 2.632379 -1.43951
C  -2.448744 1.681563 1.457436
C  -2.911042 3.061624 -2.896737
C  -2.317439 1.935029 2.953949
C  -2.176929 4.37375 -3.135643
C  -0.384542 -0.843626 -0.369476
C  -3.088729 0.92687 3.791136
C  -2.239036 4.818782 -4.588674
C  -1.777832 -0.694515 -2.318971
H  4.891159 -2.808928 1.388395
H  3.947351 -4.284455 1.54017
H  5.290209 -3.574239 -1.205799
H  5.084408 -1.854119 -0.879888
H  4.197637 -2.621018 -2.206492
H  3.308734 -5.194282 -0.726834
H  2.23599 -4.174407 -1.685945
H  1.836117 -4.548393 -0.004385
H  3.137538 -2.861086 4.064704
H  1.305601 -1.335707 4.754481
H  0.013425 -0.089625 3.059264
H  -2.004746 3.692491 0.852562
H  -0.591629 2.661284 0.963603
H  -3.514351 3.392353 -0.871844
H  -3.551592 1.70757 -1.352515
H  -3.504132 1.73896 1.173359
H  -2.126266 0.661287 1.234562
H  -2.466305 2.272824 -3.509934
H  -3.94683 3.155366 -3.237825
H  -2.666722 2.946174 3.185079
H  -1.259862 1.909023 3.235361
H  -2.606033 5.151237 -2.495359
H  -1.131338 4.276712 -2.833676
H  -2.975969 1.123125 4.858466
H  -2.741631 -0.092078 3.606588
H  -4.156402 0.954571 3.564043
H  -1.793705 4.074207 -5.251971
H  -1.700803 5.755434 -4.742595
H  -3.268808 4.975088 -4.916576
H  -2.761767 -0.863308 -1.87869
H  -1.38567 -1.646613 -2.675018
H  -1.892547 -0.03794 -3.177206
elementType: S O N C H
totalener: -1514.92666669 hartree
nucrepener: 2703.25198246 hartree
electener: -4218.17864915 hartree
oneelecener: -7445.81210086 hartree
twoeener: 3227.63345170 hartree
cpcmener: -0.02772002 hartree
kineticenergy: 1509.09787281 hartree
xcener: -129.014554996977 hartree
chargesum: 0.0000000
charge: 0.017814 -0.366257 -0.315669 -0.482893 -0.149154 -0.152960 0.369740 -0.119745 -0.121581 0.301490 -0.295318 -0.325919 -0.173497 0.043686 -0.200198 -0.135932 -0.079849 -0.120504 -0.132864 -0.133974 -0.111680 -0.067475 0.465513 -0.273219 -0.283043 -0.181942 0.091069 0.098100 0.099392 0.097037 0.100109 0.100753 0.099399 0.109578 0.148732 0.151355 0.146913 0.092941 0.092017 0.105722 0.108643 0.085797 0.055025 0.068198 0.075618 0.081784 0.063037 0.060457 0.052003 0.091913 0.077035 0.083874 0.079267 0.090004 0.078206 0.118629 0.116393 0.106427
qa: 0.0178 -0.3663 -0.3157 -0.4829 -0.1492 -0.1530 0.3697 -0.1197 -0.1216 0.3015 -0.2953 -0.3259 -0.1735 0.0437 -0.2002 -0.1359 -0.0798 -0.1205 -0.1329 -0.1340 -0.1117 -0.0675 0.4655 -0.2732 -0.2830 -0.1819 0.0911 0.0981 0.0994 0.0970 0.1001 0.1008 0.0994 0.1096 0.1487 0.1514 0.1469 0.0929 0.0920 0.1057 0.1086 0.0858 0.0550 0.0682 0.0756 0.0818 0.0630 0.0605 0.0520 0.0919 0.0770 0.0839 0.0793 0.0900 0.0782 0.1186 0.1164 0.1064
va: 2.3681 2.0969 2.0938 2.0314 3.0105 3.1769 3.6980 3.9892 3.6780 3.9011 3.9480 3.9771 3.9339 3.9030 3.9368 3.9199 3.8944 3.9099 3.8206 3.8922 3.8814 3.8427 4.2667 3.9335 3.9519 3.8889 1.0088 1.0032 1.0028 1.0053 1.0063 1.0058 1.0087 0.9988 0.9983 0.9941 0.9854 1.0003 1.0157 0.9920 0.9899 1.0120 1.0146 1.0170 1.0148 1.0065 1.0005 1.0095 1.0207 1.0041 1.0020 1.0016 1.0002 1.0037 1.0009 0.9884 1.0016 1.0032
dispcorr: -0.030950629 hartree
energy: -1514.957617320580
dipole: -16.68921 16.59722 -0.09199 13.15329 -12.80645 0.34684 -6.00981 6.17883 0.16902
magnitude: 0.39665 au
magnitude: 1.00819 debye
