program: Orca
programVersion: 5.0.2
elementType: S O O O N N C C C C C C C C C C C C C C C C C C C C H H H H H H H H H H H H H H H H H H H H H H H H H H H H H H H H
charge: 0
multiplicity: 1
keywords: wb97x-d3
keywords: def2-TZVPP
keywords: def2/J RIJCOSX
keywords: DEFGRID2
keywords: scfconv7
keywords: smallprint printgap noloewdin
keywords: NOSOSCF
formula: C20H32N2O3S
InChI: InChI=1/C20H32N2O3S/c1-6-8-13-22(14-9-7-2)26-21(5)19(23)24-17-12-10-11-16-15-20(3,4)25-18(16)17/h10-12H,6-9,13-15H2,1-5H3
58 atoms
S  -1.472138 2.178715 0.679045
O  1.006879 -1.631716 -0.03875
O  0.879319 0.806739 1.398448
O  -0.034817 -0.687478 2.806889
N  -1.602518 1.442561 -0.783771
N  -1.311322 0.940756 1.868336
C  1.375919 -2.960071 -0.532873
C  2.916073 -3.037069 -0.379044
C  3.226622 -1.847541 0.476526
C  2.062816 -1.108898 0.599789
C  0.919453 -3.048717 -1.973565
C  0.674692 -3.974066 0.351877
C  4.394063 -1.409081 1.074271
C  2.034332 0.065661 1.330648
C  4.375232 -0.219852 1.799441
C  3.200322 0.511302 1.931827
C  -2.904458 1.115353 -1.353411
C  -0.435775 1.322728 -1.65016
C  -3.017377 -0.321494 -1.851987
C  -0.490733 2.221845 -2.880232
C  -2.932092 -1.381348 -0.759077
C  -0.647824 3.699431 -2.548854
C  -0.152129 0.271703 2.081281
C  -4.197671 -1.47322 0.081962
C  -0.625453 4.585286 -3.784867
C  -2.481853 0.469051 2.596151
H  3.42188 -2.972792 -1.346678
H  3.222124 -3.978983 0.080107
H  1.173575 -4.026161 -2.385149
H  1.405622 -2.291436 -2.590637
H  -0.161595 -2.922671 -2.059534
H  0.912098 -4.98721 0.024453
H  -0.409253 -3.855854 0.310032
H  0.989492 -3.878161 1.393113
H  5.311386 -1.976452 0.979411
H  5.279188 0.139443 2.272901
H  3.18605 1.43251 2.501019
H  -3.125864 1.793996 -2.185244
H  -3.661596 1.311797 -0.593741
H  -0.305584 0.281434 -1.962838
H  0.445021 1.577353 -1.062878
H  -3.974617 -0.413005 -2.375355
H  -2.252972 -0.505099 -2.612076
H  0.440212 2.065908 -3.43508
H  -1.293355 1.904623 -3.55438
H  -2.063965 -1.186109 -0.122125
H  -2.748203 -2.35499 -1.221102
H  -1.5859 3.860657 -2.009464
H  0.15117 4.0044 -1.865174
H  -4.090706 -2.201015 0.887942
H  -5.04756 -1.786083 -0.528788
H  -4.462223 -0.518994 0.54016
H  0.315653 4.487888 -4.329874
H  -0.744802 5.637883 -3.522789
H  -1.431889 4.326178 -4.474444
H  -2.330784 0.550105 3.673085
H  -2.723964 -0.565795 2.355795
H  -3.329377 1.093294 2.328986
elementType: S O N C H
totalener: -1514.92279338 hartree
nucrepener: 2816.38200619 hartree
electener: -4331.30479957 hartree
oneelecener: -7671.99063863 hartree
twoeener: 3340.68583906 hartree
cpcmener: -0.02627648 hartree
kineticenergy: 1509.09433912 hartree
xcener: -129.019374416515 hartree
chargesum: 0.0000000
charge: 0.026390 -0.361609 -0.321431 -0.480867 -0.142014 -0.140478 0.353688 -0.126452 -0.107959 0.327289 -0.318658 -0.322302 -0.180152 0.061951 -0.155970 -0.204305 -0.122662 -0.111716 -0.107221 -0.116751 -0.076783 -0.086811 0.465919 -0.309358 -0.284391 -0.195335 0.092561 0.098824 0.114410 0.101165 0.097494 0.103309 0.098537 0.110141 0.148153 0.154545 0.146761 0.097100 0.097712 0.088311 0.105295 0.076347 0.081630 0.079336 0.070594 0.023593 0.079474 0.052091 0.062827 0.097751 0.091085 0.080469 0.079005 0.090269 0.078605 0.129662 0.111339 0.099595
qa: 0.0264 -0.3616 -0.3214 -0.4809 -0.1420 -0.1405 0.3537 -0.1265 -0.1080 0.3273 -0.3187 -0.3223 -0.1802 0.0620 -0.1560 -0.2043 -0.1227 -0.1117 -0.1072 -0.1168 -0.0768 -0.0868 0.4659 -0.3094 -0.2844 -0.1953 0.0926 0.0988 0.1144 0.1012 0.0975 0.1033 0.0985 0.1101 0.1482 0.1545 0.1468 0.0971 0.0977 0.0883 0.1053 0.0763 0.0816 0.0793 0.0706 0.0236 0.0795 0.0521 0.0628 0.0978 0.0911 0.0805 0.0790 0.0903 0.0786 0.1297 0.1113 0.0996
va: 2.3766 2.0719 2.0763 2.0304 3.0009 3.1547 3.7186 4.0201 3.6994 3.8606 3.9461 3.9842 3.9502 3.7803 3.8797 4.0028 3.9211 3.9528 3.8294 3.8641 3.8401 3.8567 4.2843 3.9587 3.9612 3.8966 1.0066 1.0036 1.0047 1.0025 1.0037 1.0054 1.0040 0.9988 0.9975 0.9898 0.9999 0.9961 1.0081 0.9988 1.0089 1.0142 1.0062 1.0134 1.0036 1.0256 1.0082 1.0098 1.0090 1.0007 1.0058 0.9939 1.0008 1.0030 1.0006 0.9983 0.9816 1.0119
dispcorr: -0.034832281 hartree
energy: -1514.957625659227
dipole: -18.98767 18.81708 -0.17059 -5.24182 4.43970 -0.80212 -26.10968 24.14954 -1.96013
magnitude: 2.12476 au
magnitude: 5.40072 debye
