program: Orca
programVersion: 5.0.2
elementType: S O O O N N C C C C C C C C C C C C C C C C C C C C H H H H H H H H H H H H H H H H H H H H H H H H H H H H H H H H
charge: 0
multiplicity: 1
keywords: wb97x-d3
keywords: def2-TZVPP
keywords: def2/J RIJCOSX
keywords: DEFGRID2
keywords: scfconv7
keywords: smallprint printgap noloewdin
keywords: NOSOSCF
formula: C20H32N2O3S
InChI: InChI=1/C20H32N2O3S/c1-6-8-13-22(14-9-7-2)26-21(5)19(23)24-17-12-10-11-16-15-20(3,4)25-18(16)17/h10-12H,6-9,13-15H2,1-5H3
58 atoms
S  -1.914189 2.139069 1.14929
O  0.97369 -1.322033 -0.075875
O  0.64269 1.003796 1.552226
O  0.02263 -0.79111 2.759123
N  -1.942929 1.842641 -0.47471
N  -1.530509 0.682449 1.998859
C  1.498706 -2.585079 -0.595183
C  3.012095 -2.328634 -0.772316
C  3.244741 -1.157218 0.133535
C  2.000386 -0.646171 0.464748
C  0.780283 -2.888652 -1.891208
C  1.234775 -3.646324 0.459892
C  4.394282 -0.550403 0.603547
C  1.875861 0.463452 1.283055
C  4.275817 0.574983 1.41598
C  3.0253 1.075576 1.758205
C  -2.998377 0.989519 -1.010969
C  -0.674712 1.861303 -1.204016
C  -2.621404 -0.482956 -1.15046
C  -0.838309 2.268894 -2.661327
C  -3.78765 -1.345864 -1.624543
C  0.506055 2.516803 -3.341694
C  -0.268867 0.212755 2.152932
C  -4.89445 -1.508975 -0.59157
C  1.408764 1.291727 -3.404363
C  -2.605783 -0.103616 2.589336
H  3.257808 -2.07388 -1.807835
H  3.6008 -3.207372 -0.505628
H  0.903128 -2.079637 -2.613326
H  -0.286929 -3.051231 -1.730041
H  1.188592 -3.796809 -2.335813
H  1.586934 -4.618374 0.112745
H  0.167809 -3.732096 0.671038
H  1.751194 -3.420791 1.395201
H  5.371424 -0.93796 0.34415
H  5.163397 1.06469 1.793644
H  2.937283 1.947402 2.394498
H  -3.294618 1.374426 -1.991759
H  -3.868363 1.108345 -0.363727
H  -0.17236 0.89223 -1.145303
H  -0.026431 2.585829 -0.708733
H  -1.798832 -0.577328 -1.864974
H  -2.244366 -0.868868 -0.198774
H  -1.3794 1.498661 -3.21974
H  -1.443085 3.178544 -2.713456
H  -3.405012 -2.334027 -1.892073
H  -4.202232 -0.925717 -2.546551
H  0.318338 2.873623 -4.357483
H  1.029109 3.329402 -2.828223
H  -5.37531 -0.561627 -0.342964
H  -4.507338 -1.935419 0.336285
H  -5.675953 -2.177787 -0.955634
H  2.303141 1.495638 -3.994885
H  0.896066 0.446179 -3.869142
H  1.743667 0.972098 -2.416335
H  -2.536414 -1.154141 2.306001
H  -3.555942 0.283011 2.231688
H  -2.597903 -0.0366 3.678946
elementType: S O N C H
totalener: -1514.92332996 hartree
nucrepener: 2846.43345548 hartree
electener: -4361.35678544 hartree
oneelecener: -7731.75688711 hartree
twoeener: 3370.40010167 hartree
cpcmener: -0.02590811 hartree
kineticenergy: 1509.08810416 hartree
xcener: -129.015252441885 hartree
chargesum: -0.0000000
charge: 0.013112 -0.358381 -0.316445 -0.477608 -0.134937 -0.164920 0.365882 -0.127551 -0.085652 0.273774 -0.316933 -0.331252 -0.187886 0.108755 -0.147237 -0.224013 -0.115740 -0.079110 -0.107841 -0.108779 -0.095499 -0.107588 0.468639 -0.280948 -0.269108 -0.185664 0.089927 0.101109 0.095971 0.100449 0.114153 0.102647 0.100023 0.110480 0.148327 0.154778 0.146505 0.100192 0.101861 0.041035 0.100509 0.076281 0.062542 0.069057 0.078269 0.069944 0.057416 0.071292 0.058179 0.081549 0.077378 0.095671 0.096904 0.079487 0.069724 0.108220 0.101592 0.131460
qa: 0.0131 -0.3584 -0.3164 -0.4776 -0.1349 -0.1649 0.3659 -0.1276 -0.0857 0.2738 -0.3169 -0.3313 -0.1879 0.1088 -0.1472 -0.2240 -0.1157 -0.0791 -0.1078 -0.1088 -0.0955 -0.1076 0.4686 -0.2809 -0.2691 -0.1857 0.0899 0.1011 0.0960 0.1004 0.1142 0.1026 0.1000 0.1105 0.1483 0.1548 0.1465 0.1002 0.1019 0.0410 0.1005 0.0763 0.0625 0.0691 0.0783 0.0699 0.0574 0.0713 0.0582 0.0815 0.0774 0.0957 0.0969 0.0795 0.0697 0.1082 0.1016 0.1315
va: 2.3342 2.0537 2.0736 2.0376 3.0595 3.1347 3.7278 3.9950 3.6604 3.8481 3.9299 3.9766 3.9558 3.7757 3.8697 4.0124 3.9113 3.9290 3.8244 3.8617 3.9038 3.9009 4.2883 3.9329 3.9297 3.8867 1.0084 1.0042 1.0036 1.0026 1.0060 1.0066 1.0081 0.9989 0.9976 0.9895 1.0011 0.9936 1.0131 1.0062 1.0136 1.0096 1.0159 1.0073 1.0178 1.0061 1.0092 1.0071 1.0095 0.9990 1.0005 1.0066 1.0061 1.0016 0.9975 0.9923 1.0091 0.9962
dispcorr: -0.035985200 hartree
energy: -1514.959315161667
dipole: -13.59857 13.59191 -0.00666 -13.58852 12.72504 -0.86349 -27.92033 25.87150 -2.04884
magnitude: 2.22337 au
magnitude: 5.65136 debye
