program: Orca
programVersion: 5.0.2
elementType: S O O O N N C C C C C C C C C C C C C C C C C C C C H H H H H H H H H H H H H H H H H H H H H H H H H H H H H H H H
charge: 0
multiplicity: 1
keywords: wb97x-d3
keywords: def2-TZVPP
keywords: def2/J RIJCOSX
keywords: DEFGRID2
keywords: scfconv7
keywords: smallprint printgap noloewdin
keywords: NOSOSCF
formula: C20H32N2O3S
InChI: InChI=1/C20H32N2O3S/c1-6-8-13-22(14-9-7-2)26-21(5)19(23)24-17-12-10-11-16-15-20(3,4)25-18(16)17/h10-12H,6-9,13-15H2,1-5H3
58 atoms
S  -2.109126 1.410449 0.694371
O  1.721571 -1.413198 -0.151906
O  0.608853 0.804052 1.254632
O  0.261628 -1.001022 2.546735
N  -2.326632 0.79218 -0.835392
N  -1.499492 0.146907 1.692912
C  2.596226 -2.474277 -0.649772
C  4.034423 -1.929424 -0.470958
C  3.831212 -0.7383 0.414933
C  2.467024 -0.522085 0.514225
C  2.228552 -2.716517 -2.098112
C  2.351284 -3.698028 0.214284
C  4.71865 0.115029 1.043501
C  1.961153 0.547485 1.232434
C  4.216348 1.189689 1.773332
C  2.84612 1.403292 1.86869
C  -3.385578 -0.200279 -1.018975
C  -1.126057 0.538111 -1.632622
C  -4.750417 0.223681 -0.50498
C  -0.32887 1.797143 -1.934266
C  -5.273403 1.523101 -1.101144
C  0.996982 1.505853 -2.630903
C  -0.175405 -0.09433 1.878417
C  -6.693428 1.828555 -0.649212
C  0.86265 0.79186 -3.968611
C  -2.421444 -0.745528 2.38478
H  4.475535 -1.635799 -1.427605
H  4.693837 -2.680074 -0.032084
H  1.189218 -3.033723 -2.198924
H  2.857827 -3.502898 -2.516566
H  2.376035 -1.817738 -2.699415
H  2.962336 -4.531846 -0.133873
H  1.306284 -4.009327 0.174428
H  2.612132 -3.507444 1.257265
H  5.787067 -0.042973 0.966141
H  4.894488 1.86727 2.274493
H  2.459311 2.242089 2.433986
H  -3.104575 -1.164105 -0.573607
H  -3.463398 -0.372937 -2.095569
H  -1.468653 0.099254 -2.571687
H  -0.489796 -0.220588 -1.161352
H  -5.439197 -0.591208 -0.749223
H  -4.75216 0.294777 0.585786
H  -0.93751 2.461119 -2.555943
H  -0.125164 2.339751 -1.008917
H  -5.240247 1.462107 -2.19363
H  -4.617792 2.35202 -0.823928
H  1.522429 2.452107 -2.78318
H  1.632806 0.914844 -1.964819
H  -6.756502 1.90206 0.438609
H  -7.389159 1.048098 -0.964478
H  -7.051935 2.772891 -1.061622
H  1.834352 0.682935 -4.453046
H  0.216917 1.346978 -4.652891
H  0.443299 -0.210094 -3.863213
H  -2.36609 -1.762516 1.996857
H  -3.432227 -0.377882 2.242488
H  -2.219818 -0.76655 3.455188
elementType: S O N C H
totalener: -1514.92570524 hartree
nucrepener: 2784.15683258 hartree
electener: -4299.08253782 hartree
oneelecener: -7607.49700953 hartree
twoeener: 3308.41447171 hartree
cpcmener: -0.02611399 hartree
kineticenergy: 1509.10148331 hartree
xcener: -129.014851188542 hartree
chargesum: -0.0000000
charge: 0.018990 -0.352149 -0.310613 -0.480096 -0.124773 -0.161050 0.365997 -0.144909 -0.081739 0.306088 -0.315591 -0.319111 -0.171807 0.040254 -0.166703 -0.195151 -0.134748 -0.134137 -0.126233 -0.101973 -0.065449 -0.105350 0.479236 -0.280809 -0.298045 -0.184601 0.092704 0.099524 0.103359 0.110624 0.096722 0.101381 0.098866 0.108344 0.148634 0.155192 0.147182 0.111334 0.103276 0.105065 0.079115 0.076025 0.068790 0.075898 0.075133 0.059834 0.050387 0.077046 0.042377 0.078603 0.078260 0.089242 0.097262 0.093036 0.076874 0.117004 0.109525 0.117855
qa: 0.0190 -0.3521 -0.3106 -0.4801 -0.1248 -0.1611 0.3660 -0.1449 -0.0817 0.3061 -0.3156 -0.3191 -0.1718 0.0403 -0.1667 -0.1952 -0.1347 -0.1341 -0.1262 -0.1020 -0.0654 -0.1053 0.4792 -0.2808 -0.2980 -0.1846 0.0927 0.0995 0.1034 0.1106 0.0967 0.1014 0.0989 0.1083 0.1486 0.1552 0.1472 0.1113 0.1033 0.1051 0.0791 0.0760 0.0688 0.0759 0.0751 0.0598 0.0504 0.0770 0.0424 0.0786 0.0783 0.0892 0.0973 0.0930 0.0769 0.1170 0.1095 0.1179
va: 2.3454 2.0638 2.0839 2.0352 3.0257 3.1753 3.7113 4.0423 3.6874 3.8250 3.9435 3.9757 3.9497 3.7945 3.8859 3.9948 3.9241 3.9353 3.8589 3.8051 3.8451 3.9001 4.2647 3.9510 3.9319 3.8885 1.0071 1.0034 1.0050 1.0060 0.9975 1.0050 1.0087 0.9986 0.9966 0.9897 0.9991 0.9928 0.9989 0.9963 1.0151 1.0147 1.0151 1.0166 1.0324 1.0102 1.0226 1.0104 1.0140 1.0003 1.0009 1.0041 1.0021 1.0030 0.9965 0.9903 1.0015 0.9996
dispcorr: -0.033299746 hartree
energy: -1514.959004981699
dipole: -17.22194 17.37625 0.15431 -6.20735 5.26389 -0.94346 -25.10842 23.49736 -1.61106
magnitude: 1.87335 au
magnitude: 4.76168 debye
