program: Orca
programVersion: 5.0.2
elementType: S O O O N N C C C C C C C C C C C C C C C C C C C C H H H H H H H H H H H H H H H H H H H H H H H H H H H H H H H H
charge: 0
multiplicity: 1
keywords: wb97x-d3
keywords: def2-TZVPP
keywords: def2/J RIJCOSX
keywords: DEFGRID2
keywords: scfconv7
keywords: smallprint printgap noloewdin
keywords: NOSOSCF
formula: C20H32N2O3S
InChI: InChI=1/C20H32N2O3S/c1-6-8-13-22(14-9-7-2)26-21(5)19(23)24-17-12-10-11-16-15-20(3,4)25-18(16)17/h10-12H,6-9,13-15H2,1-5H3
58 atoms
S  -1.119807 2.390772 0.931122
O  1.385826 -1.690197 -0.190081
O  0.490841 0.232485 1.745985
O  2.457452 0.967368 0.940861
N  -1.793406 1.900672 -0.498456
N  0.58996 2.25524 0.779167
C  2.149105 -2.756426 -0.839728
C  2.252656 -3.869626 0.22763
C  1.947282 -3.130097 1.494346
C  1.44557 -1.888819 1.134836
C  3.51441 -2.181826 -1.176129
C  1.387788 -3.178142 -2.076886
C  2.045595 -3.485329 2.825955
C  1.047511 -0.975323 2.094585
C  1.636067 -2.573765 3.796644
C  1.145094 -1.326338 3.432852
C  -1.766722 0.47658 -0.826747
C  -1.75177 2.806987 -1.644234
C  -2.577611 -0.376439 0.134937
C  -3.112047 2.941085 -2.31361
C  -2.417167 -1.873243 -0.112827
C  -3.070173 3.854048 -3.532543
C  1.2761 1.135443 1.129578
C  -2.857982 -2.331794 -1.495803
C  -4.440821 4.053103 -4.161409
C  1.337096 3.309732 0.106903
H  3.239951 -4.333796 0.226036
H  1.521178 -4.664549 0.053319
H  3.428092 -1.327326 -1.848926
H  4.130502 -2.935545 -1.668458
H  4.04295 -1.856907 -0.277339
H  1.92152 -3.98248 -2.584303
H  1.283917 -2.352512 -2.782844
H  0.39135 -3.546419 -1.826279
H  2.429807 -4.456096 3.113278
H  1.704793 -2.831747 4.844939
H  0.830513 -0.618417 4.189543
H  -0.733956 0.110483 -0.891741
H  -2.178976 0.376736 -1.832173
H  -1.000111 2.470903 -2.370024
H  -1.429803 3.789273 -1.295872
H  -2.278345 -0.158192 1.162445
H  -3.63253 -0.096296 0.052654
H  -3.486543 1.956943 -2.61302
H  -3.824005 3.332704 -1.580742
H  -2.993574 -2.412229 0.643542
H  -1.373223 -2.157403 0.048403
H  -2.656879 4.826545 -3.246887
H  -2.382131 3.439569 -4.275887
H  -2.801403 -3.417906 -1.58575
H  -2.234773 -1.912833 -2.287813
H  -3.890512 -2.039766 -1.701625
H  -4.874944 3.10387 -4.482481
H  -4.388926 4.702527 -5.036805
H  -5.138269 4.509531 -3.455671
H  2.265544 3.528289 0.63294
H  0.734029 4.213462 0.104103
H  1.572625 3.047169 -0.92558
elementType: S O N C H
totalener: -1514.92697345 hartree
nucrepener: 2750.76080715 hartree
electener: -4265.68778060 hartree
oneelecener: -7540.71094221 hartree
twoeener: 3275.02316161 hartree
cpcmener: -0.02609590 hartree
kineticenergy: 1509.09492471 hartree
xcener: -129.012085651628 hartree
chargesum: 0.0000000
charge: 0.017598 -0.359223 -0.310641 -0.480985 -0.133968 -0.161197 0.364684 -0.130307 -0.072711 0.268073 -0.325966 -0.305549 -0.184375 0.078962 -0.156810 -0.206468 -0.152787 -0.091556 -0.103017 -0.099791 -0.092087 -0.085129 0.476016 -0.299120 -0.279299 -0.182796 0.099702 0.090270 0.099609 0.100803 0.110032 0.107859 0.102232 0.096001 0.148449 0.154975 0.146704 0.097268 0.115629 0.096839 0.089095 0.073016 0.076518 0.065237 0.056085 0.075031 0.034560 0.058762 0.058851 0.094828 0.080901 0.091413 0.078721 0.090597 0.078769 0.114406 0.103265 0.122022
qa: 0.0176 -0.3592 -0.3106 -0.4810 -0.1340 -0.1612 0.3647 -0.1303 -0.0727 0.2681 -0.3260 -0.3055 -0.1844 0.0790 -0.1568 -0.2065 -0.1528 -0.0916 -0.1030 -0.0998 -0.0921 -0.0851 0.4760 -0.2991 -0.2793 -0.1828 0.0997 0.0903 0.0996 0.1008 0.1100 0.1079 0.1022 0.0960 0.1484 0.1550 0.1467 0.0973 0.1156 0.0968 0.0891 0.0730 0.0765 0.0652 0.0561 0.0750 0.0346 0.0588 0.0589 0.0948 0.0809 0.0914 0.0787 0.0906 0.0788 0.1144 0.1033 0.1220
va: 2.3471 2.0598 2.0817 2.0323 3.0215 3.1650 3.7266 4.0076 3.6714 3.8538 3.9761 3.9332 3.9560 3.8008 3.8789 4.0004 3.9229 3.9069 3.8315 3.8643 3.8904 3.8774 4.2680 3.9331 3.9499 3.8883 1.0039 1.0082 1.0091 1.0065 0.9988 1.0051 1.0060 1.0001 0.9977 0.9899 0.9996 1.0189 0.9831 0.9949 1.0098 1.0308 1.0158 1.0160 1.0223 1.0100 1.0240 1.0061 1.0084 1.0034 0.9963 1.0023 1.0008 1.0036 1.0004 1.0022 1.0093 0.9854
dispcorr: -0.032197105 hartree
energy: -1514.959170554652
dipole: -19.17033 18.78751 -0.38282 -0.75240 -0.09240 -0.84480 -32.86324 31.37704 -1.48620
magnitude: 1.75186 au
magnitude: 4.45289 debye
