program: Orca
programVersion: 5.0.2
elementType: S O O O N N C C C C C C C C C C C C C C C C C C C C H H H H H H H H H H H H H H H H H H H H H H H H H H H H H H H H
charge: 0
multiplicity: 1
keywords: wb97x-d3
keywords: def2-TZVPP
keywords: def2/J RIJCOSX
keywords: DEFGRID2
keywords: scfconv7
keywords: smallprint printgap noloewdin
keywords: NOSOSCF
formula: C20H32N2O3S
InChI: InChI=1/C20H32N2O3S/c1-6-8-13-22(14-9-7-2)26-21(5)19(23)24-17-12-10-11-16-15-20(3,4)25-18(16)17/h10-12H,6-9,13-15H2,1-5H3
58 atoms
S  -1.957536 1.993474 1.381941
O  1.381979 -0.742887 -0.399755
O  0.250673 0.31876 1.989625
O  1.893034 1.715119 1.347611
N  -2.423247 1.150041 0.042128
N  -0.277008 2.380769 1.273754
C  2.34426 -1.32822 -1.332226
C  2.844063 -2.606268 -0.620725
C  2.496099 -2.330094 0.811038
C  1.63958 -1.241781 0.819014
C  3.464016 -0.316738 -1.509336
C  1.617333 -1.602712 -2.629467
C  2.840169 -2.952155 1.996536
C  1.129074 -0.739008 2.002273
C  2.31633 -2.460839 3.19029
C  1.470483 -1.357923 3.194526
C  -2.237479 -0.299461 0.026323
C  -2.441653 1.827756 -1.249741
C  -3.346305 -1.033993 -0.711787
C  -1.197755 1.608985 -2.106507
C  -3.152412 -2.543738 -0.627923
C  -1.206958 2.481856 -3.354675
C  0.717621 1.491515 1.516278
C  -4.26003 -3.318995 -1.323559
C  -0.016454 2.216296 -4.262925
C  0.116292 3.678765 0.743738
H  3.911035 -2.763589 -0.78457
H  2.324606 -3.498249 -0.983891
H  3.080185 0.630454 -1.891723
H  4.201484 -0.691138 -2.220515
H  3.981071 -0.120074 -0.567874
H  1.257518 -0.680133 -3.088834
H  0.766301 -2.267866 -2.47509
H  2.292147 -2.082941 -3.338937
H  3.504808 -3.806943 2.000974
H  2.574516 -2.933054 4.128656
H  1.073792 -0.972918 4.125642
H  -2.224898 -0.637786 1.062741
H  -1.27044 -0.572588 -0.408048
H  -2.581586 2.893799 -1.059679
H  -3.323586 1.499982 -1.808646
H  -4.313575 -0.75802 -0.280589
H  -3.374927 -0.73844 -1.764955
H  -0.296578 1.816513 -1.521605
H  -1.132941 0.557961 -2.4059
H  -3.099538 -2.846261 0.422375
H  -2.186622 -2.810199 -1.068772
H  -2.134387 2.314753 -3.911614
H  -1.215082 3.535882 -3.060327
H  -5.2342 -3.104601 -0.879562
H  -4.098601 -4.395743 -1.253225
H  -4.319306 -3.065322 -2.383843
H  0.927991 2.38399 -3.740612
H  -0.027272 2.868153 -5.137851
H  -0.014312 1.185818 -4.624055
H  -0.75045 4.3333 0.7523
H  0.486094 3.608857 -0.280893
H  0.887026 4.13591 1.363097
elementType: S O N C H
totalener: -1514.92615539 hartree
nucrepener: 2810.63357576 hartree
electener: -4325.55973115 hartree
oneelecener: -7660.18247708 hartree
twoeener: 3334.62274593 hartree
cpcmener: -0.02565702 hartree
kineticenergy: 1509.09641089 hartree
xcener: -129.014301795773 hartree
chargesum: -0.0000000
charge: 0.013096 -0.363509 -0.317758 -0.478426 -0.132483 -0.166229 0.360998 -0.119702 -0.105265 0.299237 -0.330001 -0.303383 -0.191530 0.100302 -0.149436 -0.211419 -0.091838 -0.119409 -0.095792 -0.102246 -0.080273 -0.083212 0.469292 -0.283275 -0.286413 -0.166269 0.099406 0.090137 0.098070 0.103358 0.110999 0.086740 0.099201 0.112217 0.148144 0.155174 0.146354 0.095887 0.056159 0.096574 0.104267 0.066602 0.065061 0.056344 0.068707 0.060499 0.057806 0.062398 0.060574 0.079785 0.090561 0.078509 0.080842 0.099177 0.078513 0.100608 0.108944 0.117324
qa: 0.0131 -0.3635 -0.3178 -0.4784 -0.1325 -0.1662 0.3610 -0.1197 -0.1053 0.2992 -0.3300 -0.3034 -0.1915 0.1003 -0.1494 -0.2114 -0.0918 -0.1194 -0.0958 -0.1022 -0.0803 -0.0832 0.4693 -0.2833 -0.2864 -0.1663 0.0994 0.0901 0.0981 0.1034 0.1110 0.0867 0.0992 0.1122 0.1481 0.1552 0.1464 0.0959 0.0562 0.0966 0.1043 0.0666 0.0651 0.0563 0.0687 0.0605 0.0578 0.0624 0.0606 0.0798 0.0906 0.0785 0.0808 0.0992 0.0785 0.1006 0.1089 0.1173
va: 2.3399 2.0683 2.0845 2.0328 3.0527 3.1526 3.7338 3.9904 3.6806 3.8602 3.9795 3.9328 3.9559 3.7919 3.8738 4.0142 3.9398 3.9379 3.8449 3.7903 3.8807 3.8834 4.2839 3.9511 3.9378 3.8849 1.0041 1.0081 1.0082 1.0068 0.9991 1.0061 1.0044 1.0066 0.9980 0.9895 1.0004 1.0164 1.0145 1.0128 0.9900 1.0187 1.0086 1.0129 1.0059 1.0070 1.0075 1.0084 1.0069 1.0001 1.0038 1.0006 0.9998 1.0056 0.9995 1.0135 0.9863 1.0004
dispcorr: -0.033902211 hartree
energy: -1514.960057596642
dipole: -10.15824 9.97522 -0.18301 -6.32688 5.33178 -0.99510 -35.34652 33.53499 -1.81153
magnitude: 2.07494 au
magnitude: 5.27408 debye
