program: Orca
programVersion: 5.0.2
elementType: S O O O N N C C C C C C C C C C C C C C C C C C C C H H H H H H H H H H H H H H H H H H H H H H H H H H H H H H H H
charge: 0
multiplicity: 1
keywords: wb97x-d3
keywords: def2-TZVPP
keywords: def2/J RIJCOSX
keywords: DEFGRID2
keywords: scfconv7
keywords: smallprint printgap noloewdin
keywords: NOSOSCF
formula: C20H32N2O3S
InChI: InChI=1/C20H32N2O3S/c1-6-8-13-22(14-9-7-2)26-21(5)19(23)24-17-12-10-11-16-15-20(3,4)25-18(16)17/h10-12H,6-9,13-15H2,1-5H3
58 atoms
S  -2.058111 0.422757 -0.409733
O  1.409463 -2.625406 1.575861
O  0.623148 -0.468769 -0.136855
O  1.02843 0.39523 1.89951
N  -1.923441 1.785728 -1.352581
N  -1.015829 0.62839 0.943517
C  2.226303 -3.491254 2.426644
C  3.484722 -3.792276 1.581868
C  3.466247 -2.679685 0.57808
C  2.216019 -2.084204 0.651834
C  1.407118 -4.721313 2.748792
C  2.575208 -2.695274 3.672519
C  4.399098 -2.234654 -0.338595
C  1.881359 -1.025121 -0.173213
C  4.063224 -1.175965 -1.1799
C  2.814506 -0.573236 -1.094377
C  -0.732885 1.915395 -2.189776
C  -2.439686 3.039212 -0.807192
C  -0.559031 0.776231 -3.183138
C  -3.921546 2.999207 -0.47628
C  -1.774022 0.508341 -4.066029
C  -4.424258 4.354466 0.006354
C  0.27418 0.203467 0.975362
C  -2.251193 1.717474 -4.857339
C  -5.911805 4.347163 0.322526
C  -1.4996 1.321904 2.132108
H  3.41317 -4.765347 1.086314
H  4.38586 -3.807697 2.196495
H  1.991641 -5.406142 3.363998
H  1.116443 -5.253397 1.841873
H  0.503366 -4.466076 3.304439
H  3.167288 -3.305732 4.355463
H  1.675669 -2.376771 4.201448
H  3.161128 -1.806104 3.430152
H  5.374461 -2.700107 -0.406265
H  4.779585 -0.8115 -1.903989
H  2.559889 0.253333 -1.746401
H  0.176522 2.030641 -1.585739
H  -0.841981 2.851944 -2.74054
H  -2.279719 3.802507 -1.572755
H  -1.860634 3.36369 0.068355
H  0.299308 1.034213 -3.812109
H  -0.284165 -0.142814 -2.662756
H  -4.474776 2.693781 -1.369947
H  -4.126331 2.246039 0.289281
H  -2.597618 0.124882 -3.458262
H  -1.518374 -0.296509 -4.760671
H  -3.862933 4.654941 0.89682
H  -4.217097 5.114079 -0.753926
H  -1.443906 2.153834 -5.449941
H  -2.646352 2.502616 -4.210229
H  -3.050159 1.442515 -5.547747
H  -6.251949 5.324971 0.666857
H  -6.149297 3.623486 1.104981
H  -6.503702 4.084813 -0.557003
H  -0.98286 2.269514 2.287629
H  -1.377202 0.706012 3.023362
H  -2.559221 1.52533 2.00739
elementType: S O N C H
totalener: -1514.92549236 hartree
nucrepener: 2685.53166243 hartree
electener: -4200.45715479 hartree
oneelecener: -7410.34662022 hartree
twoeener: 3209.88946543 hartree
cpcmener: -0.02698649 hartree
kineticenergy: 1509.09154413 hartree
xcener: -129.012734600277 hartree
chargesum: 0.0000000
charge: 0.018090 -0.368093 -0.313915 -0.482776 -0.126157 -0.157854 0.372381 -0.112370 -0.085384 0.249469 -0.293175 -0.329699 -0.208861 0.094387 -0.153607 -0.189474 -0.133721 -0.145294 -0.143357 -0.080000 -0.095249 -0.083711 0.480338 -0.276347 -0.281087 -0.184649 0.089124 0.098577 0.098753 0.096304 0.100025 0.101444 0.099745 0.109312 0.148916 0.155155 0.146640 0.110617 0.108103 0.101046 0.099809 0.082640 0.074811 0.068336 0.056682 0.052160 0.070332 0.058184 0.059758 0.083638 0.074889 0.092838 0.089932 0.079079 0.078601 0.115995 0.121153 0.107523
qa: 0.0181 -0.3681 -0.3139 -0.4828 -0.1262 -0.1579 0.3724 -0.1124 -0.0854 0.2495 -0.2932 -0.3297 -0.2089 0.0944 -0.1536 -0.1895 -0.1337 -0.1453 -0.1434 -0.0800 -0.0952 -0.0837 0.4803 -0.2763 -0.2811 -0.1846 0.0891 0.0986 0.0988 0.0963 0.1000 0.1014 0.0997 0.1093 0.1489 0.1552 0.1466 0.1106 0.1081 0.1010 0.0998 0.0826 0.0748 0.0683 0.0567 0.0522 0.0703 0.0582 0.0598 0.0836 0.0749 0.0928 0.0899 0.0791 0.0786 0.1160 0.1212 0.1075
va: 2.3444 2.0985 2.0980 2.0339 2.9761 3.1695 3.7011 3.9751 3.6481 3.9272 3.9417 3.9757 3.9653 3.8898 3.8778 3.9724 3.8765 3.9196 3.8510 3.8333 3.8969 3.8838 4.2681 3.9292 3.9522 3.8910 1.0097 1.0036 1.0030 1.0063 1.0063 1.0066 1.0094 0.9991 0.9992 0.9914 0.9968 1.0083 0.9924 0.9994 0.9903 1.0111 1.0256 1.0175 1.0270 1.0193 1.0102 1.0077 1.0069 1.0015 1.0004 1.0053 1.0041 1.0001 1.0003 0.9910 0.9991 0.9989
dispcorr: -0.030451145 hartree
energy: -1514.955943505597
dipole: -21.30821 21.47687 0.16866 17.05906 -16.89255 0.16651 -6.79149 6.58473 -0.20676
magnitude: 0.31452 au
magnitude: 0.79944 debye
