program: Orca
programVersion: 5.0.2
elementType: S O O O N N C C C C C C C C C C C C C C C C C C C C H H H H H H H H H H H H H H H H H H H H H H H H H H H H H H H H
charge: 0
multiplicity: 1
keywords: wb97x-d3
keywords: def2-TZVPP
keywords: def2/J RIJCOSX
keywords: DEFGRID2
keywords: scfconv7
keywords: smallprint printgap noloewdin
keywords: NOSOSCF
formula: C20H32N2O3S
InChI: InChI=1/C20H32N2O3S/c1-6-8-13-22(14-9-7-2)26-21(5)19(23)24-17-12-10-11-16-15-20(3,4)25-18(16)17/h10-12H,6-9,13-15H2,1-5H3
58 atoms
S  -1.49813 2.323884 0.641728
O  0.915977 -1.56405 -0.013853
O  0.915206 0.970505 1.249175
O  0.1203 -0.41796 2.828524
N  -1.664738 1.593184 -0.819392
N  -1.239694 1.119736 1.858661
C  1.231113 -2.93158 -0.428907
C  2.777776 -3.02563 -0.378223
C  3.165626 -1.774689 0.349084
C  2.021773 -1.010731 0.501587
C  0.67619 -3.123639 -1.824478
C  0.577691 -3.86028 0.57761
C  4.380426 -1.30572 0.814429
C  2.059364 0.216286 1.140544
C  4.428435 -0.062286 1.440646
C  3.27266 0.691908 1.609905
C  -2.875413 0.851148 -1.139021
C  -0.514165 1.384621 -1.694585
C  -2.830287 -0.624371 -0.756654
C  -0.618707 2.177536 -2.992222
C  -4.090783 -1.367798 -1.178467
C  -0.655012 3.690427 -2.806735
C  -0.059803 0.481738 2.041822
C  -4.056133 -2.838154 -0.791197
C  0.607571 4.265724 -2.180975
C  -2.356967 0.680485 2.683825
H  3.212918 -3.054263 -1.381009
H  3.10349 -3.931178 0.136854
H  1.113126 -2.412069 -2.526884
H  -0.409079 -3.00781 -1.845224
H  0.908453 -4.128007 -2.180689
H  0.76953 -4.900503 0.311235
H  -0.503958 -3.715729 0.604465
H  0.970062 -3.695946 1.583265
H  5.282806 -1.891655 0.692437
H  5.37019 0.321788 1.808983
H  3.310572 1.654287 2.104976
H  -3.055738 0.941014 -2.215013
H  -3.71821 1.340406 -0.645327
H  -0.405635 0.320561 -1.925999
H  0.388403 1.672073 -1.159814
H  -1.960125 -1.101277 -1.218637
H  -2.696149 -0.7242 0.323509
H  0.241939 1.906353 -3.612672
H  -1.501502 1.857286 -3.553372
H  -4.223923 -1.277454 -2.261071
H  -4.965724 -0.8917 -0.724954
H  -0.812463 4.155843 -3.783571
H  -1.523948 3.968034 -2.20329
H  -4.966554 -3.355949 -1.097071
H  -3.955783 -2.962232 0.288987
H  -3.214133 -3.353014 -1.259176
H  0.568846 5.355727 -2.14831
H  1.496226 3.988069 -2.752535
H  0.756157 3.920265 -1.156593
H  -2.565443 -0.380923 2.55635
H  -3.241965 1.237312 2.393346
H  -2.167935 0.872494 3.739272
elementType: S O N C H
totalener: -1514.92445672 hartree
nucrepener: 2813.97586083 hartree
electener: -4328.90031755 hartree
oneelecener: -7667.07383299 hartree
twoeener: 3338.17351544 hartree
cpcmener: -0.02630750 hartree
kineticenergy: 1509.10166099 hartree
xcener: -129.018276699126 hartree
chargesum: -0.0000000
charge: 0.016012 -0.361978 -0.325428 -0.480991 -0.129784 -0.158453 0.359003 -0.131168 -0.103735 0.338538 -0.323652 -0.318580 -0.179557 0.055778 -0.156637 -0.206151 -0.121406 -0.096065 -0.056101 -0.132308 -0.089708 -0.109125 0.467347 -0.273533 -0.270048 -0.181014 0.092865 0.098826 0.103285 0.098140 0.116121 0.102548 0.095406 0.109688 0.148377 0.154048 0.147675 0.095790 0.094137 0.091787 0.105291 0.028221 0.063203 0.075382 0.074926 0.060766 0.057954 0.072503 0.056742 0.094933 0.079413 0.072455 0.092670 0.080770 0.068853 0.108419 0.103286 0.124264
qa: 0.0160 -0.3620 -0.3254 -0.4810 -0.1298 -0.1585 0.3590 -0.1312 -0.1037 0.3385 -0.3237 -0.3186 -0.1796 0.0558 -0.1566 -0.2062 -0.1214 -0.0961 -0.0561 -0.1323 -0.0897 -0.1091 0.4673 -0.2735 -0.2700 -0.1810 0.0929 0.0988 0.1033 0.0981 0.1161 0.1025 0.0954 0.1097 0.1484 0.1540 0.1477 0.0958 0.0941 0.0918 0.1053 0.0282 0.0632 0.0754 0.0749 0.0608 0.0580 0.0725 0.0567 0.0949 0.0794 0.0725 0.0927 0.0808 0.0689 0.1084 0.1033 0.1243
va: 2.3648 2.0718 2.0640 2.0331 3.0208 3.1503 3.7140 4.0227 3.7007 3.8599 3.9479 3.9820 3.9494 3.7593 3.8789 4.0042 3.9606 3.9349 3.8089 3.8887 3.9043 3.8790 4.2906 3.9432 3.9235 3.8838 1.0065 1.0035 1.0031 1.0020 1.0041 1.0053 1.0065 0.9994 0.9973 0.9901 0.9992 0.9955 1.0127 1.0103 0.9901 1.0305 1.0053 1.0132 1.0101 1.0070 1.0072 1.0111 1.0179 1.0055 1.0007 1.0019 1.0052 1.0025 1.0111 0.9885 1.0132 0.9968
dispcorr: -0.033884644 hartree
energy: -1514.958341365003
dipole: -17.97122 17.67711 -0.29411 -10.25237 9.13062 -1.12175 -22.94691 21.09293 -1.85398
magnitude: 2.18679 au
magnitude: 5.55839 debye
