program: Orca
programVersion: 5.0.2
elementType: S O O O N N C C C C C C C C C C C C C C C C C C C C H H H H H H H H H H H H H H H H H H H H H H H H H H H H H H H H
charge: 0
multiplicity: 1
keywords: wb97x-d3
keywords: def2-TZVPP
keywords: def2/J RIJCOSX
keywords: DEFGRID2
keywords: scfconv7
keywords: smallprint printgap noloewdin
keywords: NOSOSCF
formula: C20H32N2O3S
InChI: InChI=1/C20H32N2O3S/c1-6-8-13-22(14-9-7-2)26-21(5)19(23)24-17-12-10-11-16-15-20(3,4)25-18(16)17/h10-12H,6-9,13-15H2,1-5H3
58 atoms
S  -2.197787 1.406828 1.135029
O  1.702023 -0.519303 -0.398854
O  0.166855 0.06666 1.903333
O  1.612942 1.774184 1.721747
N  -2.281774 0.626219 -0.308642
N  -0.610721 2.079128 1.311382
C  2.707458 -0.985247 -1.352331
C  3.497878 -2.096538 -0.611549
C  2.941327 -2.04173 0.777746
C  1.921655 -1.106777 0.78383
C  3.581916 0.207137 -1.691074
C  1.9713 -1.512285 -2.566978
C  3.254959 -2.734247 1.933212
C  1.208737 -0.829746 1.937013
C  2.532708 -2.469764 3.09434
C  1.519749 -1.51691 3.098597
C  -2.027692 -0.808663 -0.397985
C  -2.259566 1.384941 -1.55012
C  -3.233291 -1.583547 -0.917763
C  -0.86985 1.57236 -2.154157
C  -4.451121 -1.496719 -0.007528
C  -0.900022 2.446941 -3.400295
C  0.482751 1.353196 1.645302
C  -5.619148 -2.337356 -0.500866
C  0.476714 2.622485 -4.022627
C  -0.470322 3.496805 1.017508
H  4.572526 -1.904203 -0.635999
H  3.339894 -3.076096 -1.069719
H  2.993952 1.019958 -2.121282
H  4.341125 -0.078777 -2.420281
H  4.096125 0.587021 -0.80618
H  1.373406 -0.733013 -3.042835
H  1.312073 -2.340662 -2.302232
H  2.685613 -1.87853 -3.305416
H  4.04677 -3.472908 1.937484
H  2.76348 -3.001749 4.007537
H  0.963823 -1.3091 4.004335
H  -1.775216 -1.17562 0.596003
H  -1.158102 -1.006196 -1.033079
H  -2.717505 2.357917 -1.357769
H  -2.903139 0.881707 -2.279127
H  -3.4979 -1.249618 -1.926382
H  -2.928703 -2.629909 -1.022471
H  -0.197778 2.015504 -1.414161
H  -0.443773 0.597938 -2.410476
H  -4.769355 -0.455078 0.085538
H  -4.169897 -1.818868 1.000492
H  -1.582461 2.012725 -4.137624
H  -1.31308 3.428313 -3.146596
H  -6.475827 -2.263431 0.170962
H  -5.350491 -3.393376 -0.572382
H  -5.952241 -2.017019 -1.490326
H  1.174236 3.082076 -3.319125
H  0.438219 3.259493 -4.90769
H  0.901301 1.663664 -4.327926
H  -0.880389 3.722663 0.034032
H  0.575784 3.789466 1.023003
H  -0.997063 4.099412 1.757517
elementType: S O N C H
totalener: -1514.92358398 hartree
nucrepener: 2799.39800669 hartree
electener: -4314.32159067 hartree
oneelecener: -7637.79702318 hartree
twoeener: 3323.47543251 hartree
cpcmener: -0.02640990 hartree
kineticenergy: 1509.09897342 hartree
xcener: -129.017016712812 hartree
chargesum: -0.0000000
charge: 0.019457 -0.356958 -0.322596 -0.481412 -0.138396 -0.146621 0.365592 -0.144953 -0.108881 0.351166 -0.312728 -0.334623 -0.172723 0.043379 -0.162821 -0.198895 -0.082596 -0.120848 -0.126332 -0.094133 -0.073958 -0.081390 0.447104 -0.284000 -0.285297 -0.183021 0.098242 0.095177 0.092795 0.103029 0.108230 0.097031 0.106888 0.117069 0.148836 0.155193 0.146811 0.099036 0.085806 0.096711 0.101280 0.066288 0.075596 0.058661 0.055819 0.052927 0.057001 0.062488 0.059662 0.090080 0.078036 0.078176 0.081037 0.098163 0.076143 0.104455 0.113744 0.126075
qa: 0.0195 -0.3570 -0.3226 -0.4814 -0.1384 -0.1466 0.3656 -0.1450 -0.1089 0.3512 -0.3127 -0.3346 -0.1727 0.0434 -0.1628 -0.1989 -0.0826 -0.1208 -0.1263 -0.0941 -0.0740 -0.0814 0.4471 -0.2840 -0.2853 -0.1830 0.0982 0.0952 0.0928 0.1030 0.1082 0.0970 0.1069 0.1171 0.1488 0.1552 0.1468 0.0990 0.0858 0.0967 0.1013 0.0663 0.0756 0.0587 0.0558 0.0529 0.0570 0.0625 0.0597 0.0901 0.0780 0.0782 0.0810 0.0982 0.0761 0.1045 0.1137 0.1261
va: 2.3434 2.0744 2.0621 2.0329 3.0217 3.1452 3.6963 4.0477 3.6995 3.8355 3.9811 3.9549 3.9443 3.7797 3.8873 4.0005 3.9315 3.9547 3.8686 3.8121 3.8547 3.8883 4.3085 3.9622 3.9435 3.8927 1.0036 1.0056 1.0068 1.0046 1.0001 1.0037 1.0007 1.0050 0.9969 0.9898 1.0001 1.0123 1.0129 1.0111 0.9954 1.0066 1.0134 1.0063 1.0181 1.0174 1.0083 1.0069 1.0070 1.0033 1.0005 1.0002 0.9988 1.0061 1.0005 0.9898 1.0188 0.9951
dispcorr: -0.033689669 hartree
energy: -1514.957273648611
dipole: -11.38281 11.38881 0.00600 -1.33329 0.43165 -0.90165 -32.96693 30.96206 -2.00486
magnitude: 2.19829 au
magnitude: 5.58761 debye
