program: Orca
programVersion: 5.0.2
elementType: S O O O N N C C C C C C C C C C C C C C C C C C C C H H H H H H H H H H H H H H H H H H H H H H H H H H H H H H H H
charge: 0
multiplicity: 1
keywords: wb97x-d3
keywords: def2-TZVPP
keywords: def2/J RIJCOSX
keywords: DEFGRID2
keywords: scfconv7
keywords: smallprint printgap noloewdin
keywords: NOSOSCF
formula: C20H32N2O3S
InChI: InChI=1/C20H32N2O3S/c1-6-8-13-22(14-9-7-2)26-21(5)19(23)24-17-12-10-11-16-15-20(3,4)25-18(16)17/h10-12H,6-9,13-15H2,1-5H3
58 atoms
S  -1.798805 1.276745 1.231221
O  2.188367 -1.409626 1.91293
O  0.425615 -0.067724 0.113692
O  -0.358713 -2.16826 0.282485
N  -2.337642 2.092567 -0.098101
N  -1.666861 -0.403463 0.855796
C  3.18474 -2.337991 2.446346
C  4.369748 -2.257801 1.454899
C  3.736481 -1.641589 0.245106
C  2.487366 -1.178462 0.627216
C  2.553877 -3.719629 2.448049
C  3.539629 -1.874918 3.841787
C  4.181909 -1.459343 -1.050412
C  1.653047 -0.549664 -0.278839
C  3.35206 -0.811077 -1.962816
C  2.092973 -0.364546 -1.580539
C  -3.732605 1.955012 -0.497353
C  -1.402796 2.454267 -1.160646
C  -4.017886 0.844265 -1.502539
C  -0.230682 3.28881 -0.667911
C  -5.508507 0.699641 -1.781429
C  0.717984 3.701988 -1.78944
C  -0.519975 -0.977853 0.414263
C  -5.814389 -0.412836 -2.772109
C  0.118327 4.681788 -2.788298
C  -2.767405 -1.300858 1.182237
H  4.796123 -3.243393 1.261828
H  5.175753 -1.626538 1.840603
H  1.650839 -3.740379 3.06021
H  3.251614 -4.45221 2.855647
H  2.288537 -4.039844 1.438263
H  2.673143 -1.899004 4.504622
H  3.939958 -0.860124 3.832509
H  4.300891 -2.529481 4.26758
H  5.15901 -1.813232 -1.354482
H  3.681653 -0.659565 -2.981945
H  1.444259 0.127626 -2.294925
H  -4.054213 2.913333 -0.919383
H  -4.32368 1.798673 0.407735
H  -1.979996 3.032909 -1.885819
H  -1.037847 1.570432 -1.697565
H  -3.491739 1.04804 -2.440707
H  -3.625698 -0.105492 -1.129277
H  -0.61492 4.179907 -0.161582
H  0.331072 2.726224 0.080092
H  -5.904804 1.6468 -2.160605
H  -6.035232 0.504434 -0.841971
H  1.606399 4.1537 -1.340911
H  1.071288 2.809095 -2.315631
H  -6.886525 -0.505075 -2.952218
H  -5.459337 -1.378228 -2.405667
H  -5.334469 -0.231303 -3.735923
H  -0.723049 4.254915 -3.336387
H  0.858456 4.991239 -3.527876
H  -0.239386 5.584208 -2.287535
H  -2.551337 -1.894785 2.072177
H  -2.988027 -1.978001 0.357517
H  -3.655392 -0.706857 1.377948
elementType: S O N C H
totalener: -1514.92570480 hartree
nucrepener: 2704.60464869 hartree
electener: -4219.53035349 hartree
oneelecener: -7448.50777921 hartree
twoeener: 3228.97742572 hartree
cpcmener: -0.02730138 hartree
kineticenergy: 1509.09845341 hartree
xcener: -129.014233543808 hartree
chargesum: -0.0000000
charge: 0.019150 -0.367125 -0.318509 -0.485725 -0.139706 -0.174422 0.370183 -0.113984 -0.087670 0.248593 -0.326836 -0.295274 -0.205531 0.110450 -0.159966 -0.201237 -0.103566 -0.116706 -0.112322 -0.117523 -0.081414 -0.100728 0.489087 -0.272119 -0.280342 -0.193364 0.098450 0.090993 0.099270 0.100928 0.108986 0.099989 0.096446 0.099338 0.148634 0.155780 0.151357 0.092394 0.094301 0.106839 0.091009 0.079083 0.065505 0.072935 0.076496 0.059415 0.057968 0.073181 0.048047 0.091107 0.078513 0.078377 0.079229 0.091466 0.081002 0.130301 0.113084 0.106185
qa: 0.0192 -0.3671 -0.3185 -0.4857 -0.1397 -0.1744 0.3702 -0.1140 -0.0877 0.2486 -0.3268 -0.2953 -0.2055 0.1104 -0.1600 -0.2012 -0.1036 -0.1167 -0.1123 -0.1175 -0.0814 -0.1007 0.4891 -0.2721 -0.2803 -0.1934 0.0985 0.0910 0.0993 0.1009 0.1090 0.1000 0.0964 0.0993 0.1486 0.1558 0.1514 0.0924 0.0943 0.1068 0.0910 0.0791 0.0655 0.0729 0.0765 0.0594 0.0580 0.0732 0.0480 0.0911 0.0785 0.0784 0.0792 0.0915 0.0810 0.1303 0.1131 0.1062
va: 2.3442 2.0990 2.0877 2.0303 3.0257 3.1354 3.7026 3.9818 3.6516 3.9563 3.9766 3.9461 3.9700 3.8335 3.8930 3.9725 3.9260 3.9032 3.7925 3.8659 3.8849 3.8996 4.2621 3.9412 3.9385 3.8868 1.0034 1.0091 1.0089 1.0064 0.9991 1.0064 1.0058 1.0028 0.9992 0.9914 0.9945 0.9994 1.0114 0.9873 0.9944 1.0119 1.0046 1.0176 1.0278 1.0092 1.0074 1.0064 1.0116 1.0042 1.0012 1.0015 0.9986 1.0043 1.0008 0.9976 0.9922 1.0054
dispcorr: -0.030492112 hartree
energy: -1514.956196913582
dipole: -15.70276 15.81095 0.10820 8.92882 -8.56074 0.36808 -12.62189 12.26260 -0.35928
magnitude: 0.52562 au
magnitude: 1.33602 debye
