program: Orca
programVersion: 5.0.2
elementType: S O O O N N C C C C C C C C C C C C C C C C C C C C H H H H H H H H H H H H H H H H H H H H H H H H H H H H H H H H
charge: 0
multiplicity: 1
keywords: wb97x-d3
keywords: def2-TZVPP
keywords: def2/J RIJCOSX
keywords: DEFGRID2
keywords: scfconv7
keywords: smallprint printgap noloewdin
keywords: NOSOSCF
formula: C20H32N2O3S
InChI: InChI=1/C20H32N2O3S/c1-6-8-13-22(14-9-7-2)26-21(5)19(23)24-17-12-10-11-16-15-20(3,4)25-18(16)17/h10-12H,6-9,13-15H2,1-5H3
58 atoms
S  -2.035669 0.737011 1.213617
O  1.867368 -2.085631 2.022773
O  0.303344 -0.500202 0.229527
O  1.812631 0.901712 1.130852
N  -2.687257 1.241481 -0.217024
N  -0.413353 1.310506 1.343359
C  2.997166 -2.802464 2.614838
C  3.553441 -3.673269 1.465341
C  2.992956 -2.996135 0.252172
C  2.021354 -2.11006 0.691265
C  2.467864 -3.61119 3.777942
C  4.006708 -1.757068 3.056971
C  3.250537 -3.137655 -1.097897
C  1.303028 -1.338754 -0.20403
C  2.522232 -2.370911 -2.005082
C  1.557988 -1.47471 -1.560612
C  -2.319821 0.523343 -1.434855
C  -3.077719 2.640379 -0.359372
C  -3.407987 0.545693 -2.498543
C  -2.024989 3.557368 -0.970328
C  -3.032133 -0.328941 -3.688952
C  -2.483537 5.010273 -0.981423
C  0.661959 0.59435 0.926253
C  -4.092244 -0.323566 -4.778903
C  -1.466961 5.942914 -1.621479
C  -0.142464 2.541387 2.075147
H  3.199166 -4.706163 1.535353
H  4.643885 -3.703905 1.478045
H  1.703583 -4.318776 3.453268
H  2.039755 -2.970084 4.550297
H  3.278333 -4.181911 4.232568
H  3.570821 -1.071272 3.785001
H  4.37153 -1.169491 2.211813
H  4.867778 -2.237421 3.523367
H  4.003604 -3.832268 -1.448377
H  2.709955 -2.465133 -3.06628
H  0.996904 -0.877151 -2.268681
H  -2.127262 -0.512632 -1.153953
H  -1.386729 0.912811 -1.861097
H  -3.355525 3.003777 0.631984
H  -3.988118 2.685196 -0.964446
H  -4.348106 0.193606 -2.062772
H  -3.586896 1.565687 -2.851647
H  -1.087859 3.47435 -0.41253
H  -1.802931 3.242468 -1.994982
H  -2.864428 -1.35524 -3.348375
H  -2.079259 0.012752 -4.104972
H  -3.43606 5.088972 -1.514787
H  -2.682688 5.335611 0.044367
H  -4.258761 0.682826 -5.168302
H  -5.049001 -0.692924 -4.404359
H  -3.803305 -0.955822 -5.619828
H  -1.806073 6.97977 -1.59986
H  -1.286464 5.679149 -2.665448
H  -0.507017 5.901469 -1.102778
H  0.561904 3.176388 1.539267
H  0.258407 2.338139 3.069662
H  -1.072628 3.090303 2.190159
elementType: S O N C H
totalener: -1514.92692133 hartree
nucrepener: 2668.16713175 hartree
electener: -4183.09405309 hartree
oneelecener: -7375.50217022 hartree
twoeener: 3192.40811713 hartree
cpcmener: -0.02758474 hartree
kineticenergy: 1509.09317853 hartree
xcener: -129.012530140462 hartree
chargesum: -0.0000000
charge: 0.017051 -0.368043 -0.316793 -0.485795 -0.129538 -0.173495 0.371229 -0.113536 -0.092051 0.255226 -0.292433 -0.327278 -0.203181 0.087713 -0.157559 -0.185634 -0.128478 -0.124996 -0.088137 -0.111071 -0.086178 -0.084297 0.491204 -0.281348 -0.272893 -0.195094 0.090076 0.098017 0.095455 0.099765 0.099121 0.099276 0.109851 0.100793 0.148959 0.155154 0.145734 0.096326 0.092367 0.100540 0.100050 0.067909 0.063056 0.069121 0.076800 0.061637 0.058708 0.060416 0.059559 0.078701 0.078893 0.090647 0.090680 0.078486 0.078591 0.113605 0.131156 0.105956
qa: 0.0171 -0.3680 -0.3168 -0.4858 -0.1295 -0.1735 0.3712 -0.1135 -0.0921 0.2552 -0.2924 -0.3273 -0.2032 0.0877 -0.1576 -0.1856 -0.1285 -0.1250 -0.0881 -0.1111 -0.0862 -0.0843 0.4912 -0.2813 -0.2729 -0.1951 0.0901 0.0980 0.0955 0.0998 0.0991 0.0993 0.1099 0.1008 0.1490 0.1552 0.1457 0.0963 0.0924 0.1005 0.1000 0.0679 0.0631 0.0691 0.0768 0.0616 0.0587 0.0604 0.0596 0.0787 0.0789 0.0906 0.0907 0.0785 0.0786 0.1136 0.1312 0.1060
va: 2.3391 2.0984 2.0993 2.0310 3.0442 3.1364 3.7029 3.9770 3.6493 3.9388 3.9441 3.9768 3.9610 3.8916 3.8786 3.9719 3.9448 3.9281 3.8292 3.7834 3.8794 3.8859 4.2565 3.9510 3.9425 3.8902 1.0093 1.0039 1.0064 1.0063 1.0027 1.0093 0.9989 1.0063 0.9993 0.9912 0.9974 1.0125 0.9909 1.0124 0.9915 1.0160 1.0084 1.0075 1.0092 1.0069 1.0080 1.0090 1.0071 1.0009 1.0000 1.0041 1.0042 1.0014 1.0011 0.9930 0.9964 1.0047
dispcorr: -0.029466228 hartree
energy: -1514.956387561371
dipole: -13.66127 13.43753 -0.22373 17.46367 -17.57092 -0.10725 -15.75147 15.18795 -0.56352
magnitude: 0.61572 au
magnitude: 1.56504 debye
