program: Orca
programVersion: 5.0.2
elementType: S O O O N N C C C C C C C C C C C C C C C C C C C C H H H H H H H H H H H H H H H H H H H H H H H H H H H H H H H H
charge: 0
multiplicity: 1
keywords: wb97x-d3
keywords: def2-TZVPP
keywords: def2/J RIJCOSX
keywords: DEFGRID2
keywords: scfconv7
keywords: smallprint printgap noloewdin
keywords: NOSOSCF
formula: C20H32N2O3S
InChI: InChI=1/C20H32N2O3S/c1-6-8-13-22(14-9-7-2)26-21(5)19(23)24-17-12-10-11-16-15-20(3,4)25-18(16)17/h10-12H,6-9,13-15H2,1-5H3
58 atoms
S  -1.63452 1.502877 1.291589
O  2.029121 -1.739895 2.158318
O  -0.00443 -0.644783 0.489565
O  1.829011 0.529009 -0.072316
N  -2.65067 1.820059 0.041077
N  -0.007041 1.592182 0.736013
C  3.271688 -2.393702 2.568002
C  3.26015 -3.751648 1.830331
C  2.282895 -3.501829 0.722744
C  1.622763 -2.319706 1.019445
C  3.246504 -2.528469 4.073814
C  4.416186 -1.515202 2.091774
C  1.962374 -4.212034 -0.418028
C  0.652692 -1.813093 0.175119
C  0.971623 -3.716216 -1.262971
C  0.32552 -2.521376 -0.970998
C  -3.074795 0.755922 -0.855553
C  -3.098538 3.181123 -0.215827
C  -2.198239 0.50093 -2.078679
C  -2.478641 3.890527 -1.412979
C  -2.703105 -0.687867 -2.887198
C  -2.930563 5.344049 -1.489908
C  0.696672 0.497822 0.348352
C  -1.854069 -0.967701 -4.117742
C  -2.408142 6.061547 -2.724846
C  0.654708 2.882721 0.615155
H  2.917112 -4.561222 2.481598
H  4.255641 -4.021962 1.475387
H  2.3886 -3.11477 4.406262
H  3.209426 -1.553539 4.562609
H  4.149424 -3.035849 4.415049
H  4.354901 -0.517248 2.528524
H  4.416402 -1.411787 1.00469
H  5.372964 -1.95058 2.382788
H  2.471241 -5.137962 -0.655066
H  0.706663 -4.255951 -2.162222
H  -0.436218 -2.133128 -1.6361
H  -4.091528 0.992958 -1.186163
H  -3.147543 -0.166206 -0.272897
H  -2.905004 3.764712 0.686385
H  -4.186842 3.158065 -0.341162
H  -2.168944 1.387113 -2.717113
H  -1.167518 0.313674 -1.769161
H  -1.387116 3.844028 -1.348517
H  -2.760377 3.380096 -2.337789
H  -3.738641 -0.508381 -3.193238
H  -2.727675 -1.577034 -2.248948
H  -4.02444 5.385304 -1.482443
H  -2.602165 5.875119 -0.591195
H  -0.816028 -1.175002 -3.848657
H  -1.849805 -0.115263 -4.800117
H  -2.226642 -1.829891 -4.672893
H  -2.740227 7.100441 -2.753552
H  -2.757348 5.581146 -3.640996
H  -1.316671 6.065802 -2.752375
H  1.639535 2.864865 1.079977
H  0.053458 3.628006 1.128162
H  0.765401 3.183158 -0.428093
elementType: S O N C H
totalener: -1514.92473744 hartree
nucrepener: 2695.46188240 hartree
electener: -4210.38661984 hartree
oneelecener: -7430.16361915 hartree
twoeener: 3219.77699931 hartree
cpcmener: -0.02786415 hartree
kineticenergy: 1509.10388704 hartree
xcener: -129.017398607995 hartree
chargesum: -0.0000000
charge: 0.018915 -0.367985 -0.320244 -0.485611 -0.147584 -0.144887 0.374356 -0.116931 -0.119430 0.282531 -0.293125 -0.329135 -0.166740 0.042237 -0.216745 -0.106041 -0.087697 -0.112170 -0.130017 -0.093890 -0.102046 -0.093476 0.478633 -0.274043 -0.271183 -0.201117 0.090304 0.098227 0.096012 0.099713 0.099034 0.099404 0.108947 0.101323 0.149392 0.150489 0.138496 0.092821 0.097118 0.087860 0.091601 0.085774 0.045383 0.072189 0.071417 0.080498 0.063347 0.057549 0.061423 0.074191 0.084063 0.092895 0.090737 0.077812 0.078373 0.122595 0.105285 0.119151
qa: 0.0189 -0.3680 -0.3202 -0.4856 -0.1476 -0.1449 0.3744 -0.1169 -0.1194 0.2825 -0.2931 -0.3291 -0.1667 0.0422 -0.2167 -0.1060 -0.0877 -0.1122 -0.1300 -0.0939 -0.1020 -0.0935 0.4786 -0.2740 -0.2712 -0.2011 0.0903 0.0982 0.0960 0.0997 0.0990 0.0994 0.1089 0.1013 0.1494 0.1505 0.1385 0.0928 0.0971 0.0879 0.0916 0.0858 0.0454 0.0722 0.0714 0.0805 0.0633 0.0575 0.0614 0.0742 0.0841 0.0929 0.0907 0.0778 0.0784 0.1226 0.1053 0.1192
va: 2.3791 2.0986 2.0982 2.0268 3.0659 3.1603 3.6983 3.9760 3.6684 3.9081 3.9425 3.9770 3.9257 3.9303 3.9543 3.8990 3.9051 3.9303 3.8107 3.7656 3.8773 3.8983 4.2518 3.9337 3.9426 3.9011 1.0090 1.0039 1.0065 1.0063 1.0028 1.0090 0.9997 1.0064 0.9983 0.9953 0.9854 1.0015 1.0115 1.0135 1.0016 1.0145 1.0221 1.0088 1.0146 1.0050 1.0026 1.0077 1.0069 1.0016 1.0016 1.0036 1.0042 1.0018 1.0007 1.0013 1.0070 0.9836
dispcorr: -0.031080066 hartree
energy: -1514.955817508096
dipole: -9.07040 8.57257 -0.49783 17.88315 -17.87112 0.01203 -18.68990 18.43676 -0.25314
magnitude: 0.55862 au
magnitude: 1.41990 debye
