program: Orca
programVersion: 5.0.2
elementType: S O O O N N C C C C C C C C C C C C C C C C C C C C H H H H H H H H H H H H H H H H H H H H H H H H H H H H H H H H
charge: 0
multiplicity: 1
keywords: wb97x-d3
keywords: def2-TZVPP
keywords: def2/J RIJCOSX
keywords: DEFGRID2
keywords: scfconv7
keywords: smallprint printgap noloewdin
keywords: NOSOSCF
formula: C20H32N2O3S
InChI: InChI=1/C20H32N2O3S/c1-6-8-13-22(14-9-7-2)26-21(5)19(23)24-17-12-10-11-16-15-20(3,4)25-18(16)17/h10-12H,6-9,13-15H2,1-5H3
58 atoms
S  -1.645066 2.005311 -0.148018
O  1.935618 -1.054454 -0.655496
O  1.076671 1.435484 0.359389
O  0.928394 1.178837 2.589883
N  -2.438412 0.597159 -0.428399
N  -0.870166 1.879369 1.38894
C  2.690209 -2.247121 -1.041233
C  4.181645 -1.878145 -0.832693
C  4.113002 -0.52541 -0.195855
C  2.779956 -0.147637 -0.146042
C  2.360411 -2.534397 -2.491545
C  2.249066 -3.375079 -0.127134
C  5.09572 0.316633 0.28646
C  2.405242 1.074771 0.382714
C  4.725217 1.551257 0.815729
C  3.389874 1.92742 0.862663
C  -3.807944 0.412326 0.030133
C  -1.771298 -0.542011 -1.048188
C  -4.780161 0.081767 -1.096176
C  -1.785843 -1.823364 -0.220425
C  -4.839083 1.147677 -2.181167
C  -1.160749 -1.70984 1.162061
C  0.414992 1.461317 1.533214
C  -5.870604 0.836979 -3.25499
C  -1.174779 -3.03082 1.916327
C  -1.674084 1.983774 2.596806
H  4.723051 -1.847753 -1.781653
H  4.689604 -2.609287 -0.200371
H  2.645347 -1.700701 -3.135403
H  1.294896 -2.726547 -2.628591
H  2.903894 -3.417459 -2.829832
H  1.184275 -3.585728 -0.241631
H  2.443602 -3.13912 0.920765
H  2.795387 -4.287672 -0.369724
H  6.138442 0.026943 0.249944
H  5.480318 2.226105 1.195874
H  3.109131 2.891699 1.267907
H  -4.124336 1.337283 0.51429
H  -3.854506 -0.368851 0.79728
H  -0.741626 -0.25341 -1.257477
H  -2.235114 -0.750443 -2.018986
H  -4.536343 -0.888777 -1.54043
H  -5.769675 -0.040058 -0.644177
H  -2.80991 -2.200111 -0.1288
H  -1.249113 -2.57999 -0.802428
H  -3.855093 1.256755 -2.645348
H  -5.06648 2.116204 -1.724245
H  -0.130766 -1.35789 1.070796
H  -1.69209 -0.956328 1.750046
H  -5.888331 1.609207 -4.025695
H  -6.876842 0.768268 -2.836489
H  -5.656669 -0.112752 -3.749862
H  -2.193836 -3.39503 2.063726
H  -0.717508 -2.931671 2.901995
H  -0.626061 -3.806306 1.377559
H  -1.971384 1.006275 2.980815
H  -2.572668 2.549713 2.365029
H  -1.136048 2.516002 3.380006
elementType: S O N C H
totalener: -1514.92440985 hartree
nucrepener: 2768.56427649 hartree
electener: -4283.48868634 hartree
oneelecener: -7576.13293240 hartree
twoeener: 3292.64424607 hartree
cpcmener: -0.02677571 hartree
kineticenergy: 1509.08412476 hartree
xcener: -129.016882347205 hartree
chargesum: -0.0000000
charge: 0.021480 -0.354668 -0.307881 -0.484139 -0.135124 -0.140658 0.374445 -0.138611 -0.109223 0.311791 -0.306512 -0.337514 -0.185714 0.028849 -0.164728 -0.161937 -0.115859 -0.109532 -0.117242 -0.124106 -0.085118 -0.098676 0.457914 -0.281757 -0.284947 -0.186401 0.096427 0.098100 0.101695 0.099056 0.103653 0.092330 0.115400 0.112515 0.148978 0.155687 0.147167 0.100300 0.101820 0.087031 0.100031 0.069320 0.079674 0.079279 0.083152 0.055407 0.059046 0.040006 0.064825 0.090233 0.078609 0.079197 0.089013 0.094251 0.079116 0.117299 0.101313 0.115937
qa: 0.0215 -0.3547 -0.3079 -0.4841 -0.1351 -0.1407 0.3744 -0.1386 -0.1092 0.3118 -0.3065 -0.3375 -0.1857 0.0288 -0.1647 -0.1619 -0.1159 -0.1095 -0.1172 -0.1241 -0.0851 -0.0987 0.4579 -0.2818 -0.2849 -0.1864 0.0964 0.0981 0.1017 0.0991 0.1037 0.0923 0.1154 0.1125 0.1490 0.1557 0.1472 0.1003 0.1018 0.0870 0.1000 0.0693 0.0797 0.0793 0.0832 0.0554 0.0590 0.0400 0.0648 0.0902 0.0786 0.0792 0.0890 0.0943 0.0791 0.1173 0.1013 0.1159
va: 2.3780 2.0805 2.1039 2.0222 3.0046 3.1787 3.6665 4.0387 3.6965 3.9227 3.9655 3.9678 3.9556 3.8851 3.8755 3.9697 3.9340 3.8988 3.8535 3.8048 3.8584 3.8712 4.2638 3.9541 3.9417 3.9033 1.0066 1.0044 1.0021 1.0041 1.0032 1.0051 0.9958 1.0084 0.9970 0.9902 0.9971 1.0076 0.9946 1.0383 0.9920 1.0041 1.0132 1.0072 1.0112 1.0127 1.0098 1.0278 1.0140 1.0032 1.0004 1.0008 1.0023 1.0033 0.9999 0.9850 1.0093 1.0021
dispcorr: -0.034392791 hartree
energy: -1514.958802641650
dipole: -26.79617 26.33828 -0.45788 -24.31503 22.75138 -1.56364 -8.99971 7.97998 -1.01972
magnitude: 1.92210 au
magnitude: 4.88559 debye
