program: Orca
programVersion: 5.0.2
elementType: S O O O N N C C C C C C C C C C C C C C C C C C C C H H H H H H H H H H H H H H H H H H H H H H H H H H H H H H H H
charge: 0
multiplicity: 1
keywords: wb97x-d3
keywords: def2-TZVPP
keywords: def2/J RIJCOSX
keywords: DEFGRID2
keywords: scfconv7
keywords: smallprint printgap noloewdin
keywords: NOSOSCF
formula: C20H32N2O3S
InChI: InChI=1/C20H32N2O3S/c1-6-8-13-22(14-9-7-2)26-21(5)19(23)24-17-12-10-11-16-15-20(3,4)25-18(16)17/h10-12H,6-9,13-15H2,1-5H3
58 atoms
S  -0.401198 2.685149 0.221871
O  0.781785 -2.491001 0.382314
O  1.007219 0.350387 0.898871
O  1.996705 -0.028633 -1.085251
N  -1.979964 2.24743 0.014659
N  0.585209 1.730803 -0.821956
C  1.201292 -3.875472 0.149156
C  2.05871 -4.231116 1.381572
C  2.462746 -2.880039 1.883529
C  1.656495 -1.947636 1.244588
C  2.030471 -3.881365 -1.124688
C  -0.037116 -4.733155 0.021325
C  3.407179 -2.480071 2.807844
C  1.802823 -0.597093 1.502791
C  3.544095 -1.121421 3.084282
C  2.750115 -0.188832 2.431701
C  -2.448133 0.986861 0.580518
C  -2.701432 2.706947 -1.169884
C  -2.421908 -0.204571 -0.371449
C  -2.626897 4.207704 -1.394087
C  -2.836417 -1.497946 0.319037
C  -3.478011 4.644015 -2.580735
C  1.252557 0.628103 -0.396008
C  -3.037137 -2.635835 -0.669287
C  -3.387671 6.139444 -2.842653
C  0.744992 2.105342 -2.220396
H  2.904867 -4.864421 1.111582
H  1.475489 -4.769812 2.134739
H  2.924867 -3.262947 -1.02536
H  1.451415 -3.509337 -1.971177
H  2.353737 -4.896199 -1.359461
H  0.254043 -5.77971 -0.077247
H  -0.621384 -4.470931 -0.860845
H  -0.674906 -4.646944 0.902231
H  4.033802 -3.207834 3.308125
H  4.279535 -0.784735 3.802541
H  2.863341 0.868435 2.63744
H  -3.476845 1.139152 0.925335
H  -1.850061 0.774768 1.468263
H  -3.748281 2.426565 -1.019619
H  -2.369289 2.180441 -2.073205
H  -3.097831 -0.016512 -1.211262
H  -1.425078 -0.331259 -0.802408
H  -2.959032 4.724814 -0.488662
H  -1.591823 4.514629 -1.565145
H  -3.763031 -1.33721 0.879203
H  -2.078078 -1.776092 1.05673
H  -3.163266 4.098193 -3.475663
H  -4.521895 4.365931 -2.406731
H  -3.270856 -3.574217 -0.164391
H  -2.142804 -2.798395 -1.273112
H  -3.858232 -2.419372 -1.355838
H  -2.363432 6.442208 -3.06932
H  -3.714961 6.715896 -1.974995
H  -4.011478 6.436197 -3.687094
H  0.227997 1.412275 -2.886357
H  1.796766 2.142433 -2.505129
H  0.324677 3.09754 -2.364045
elementType: S O N C H
totalener: -1514.92569889 hartree
nucrepener: 2727.96772505 hartree
electener: -4242.89342393 hartree
oneelecener: -7495.31701576 hartree
twoeener: 3252.42359183 hartree
cpcmener: -0.02694448 hartree
kineticenergy: 1509.10269981 hartree
xcener: -129.014481562795 hartree
chargesum: -0.0000000
charge: 0.020671 -0.368729 -0.315526 -0.485700 -0.144956 -0.160484 0.377266 -0.109519 -0.074613 0.233823 -0.330230 -0.330225 -0.207344 0.105377 -0.146027 -0.201518 -0.086125 -0.108417 -0.125593 -0.097729 -0.097942 -0.078959 0.481382 -0.298330 -0.286234 -0.177976 0.099437 0.089719 0.108910 0.100481 0.101881 0.115854 0.102377 0.101574 0.148857 0.154696 0.145467 0.093539 0.093992 0.100590 0.087763 0.079398 0.065536 0.068476 0.052262 0.068718 0.058066 0.058012 0.060220 0.096980 0.076376 0.095510 0.079381 0.079097 0.090314 0.119310 0.115339 0.105528
qa: 0.0207 -0.3687 -0.3155 -0.4857 -0.1450 -0.1605 0.3773 -0.1095 -0.0746 0.2338 -0.3302 -0.3302 -0.2073 0.1054 -0.1460 -0.2015 -0.0861 -0.1084 -0.1256 -0.0977 -0.0979 -0.0790 0.4814 -0.2983 -0.2862 -0.1780 0.0994 0.0897 0.1089 0.1005 0.1019 0.1159 0.1024 0.1016 0.1489 0.1547 0.1455 0.0935 0.0940 0.1006 0.0878 0.0794 0.0655 0.0685 0.0523 0.0687 0.0581 0.0580 0.0602 0.0970 0.0764 0.0955 0.0794 0.0791 0.0903 0.1193 0.1153 0.1055
va: 2.3527 2.0851 2.0882 2.0276 3.0266 3.1773 3.7052 3.9648 3.6296 3.9303 3.9780 3.9303 3.9698 3.8542 3.8750 4.0105 3.9030 3.9109 3.8001 3.8697 3.8519 3.8776 4.2321 3.9339 3.9544 3.8885 1.0046 1.0092 0.9997 1.0087 1.0065 1.0048 1.0001 1.0027 0.9989 0.9902 1.0005 1.0004 1.0148 0.9932 0.9833 1.0104 1.0167 1.0183 1.0280 1.0126 1.0190 1.0079 1.0076 1.0022 0.9982 1.0048 1.0001 0.9998 1.0040 0.9892 1.0022 0.9999
dispcorr: -0.031982872 hartree
energy: -1514.957681758173
dipole: -27.70045 26.63090 -1.06955 -1.09570 0.28660 -0.80910 -19.07404 18.84824 -0.22581
magnitude: 1.35999 au
magnitude: 3.45682 debye
