program: Orca
programVersion: 5.0.2
elementType: S O O O N N C C C C C C C C C C C C C C C C C C C C H H H H H H H H H H H H H H H H H H H H H H H H H H H H H H H H
charge: 0
multiplicity: 1
keywords: wb97x-d3
keywords: def2-TZVPP
keywords: def2/J RIJCOSX
keywords: DEFGRID2
keywords: scfconv7
keywords: smallprint printgap noloewdin
keywords: NOSOSCF
formula: C20H32N2O3S
InChI: InChI=1/C20H32N2O3S/c1-6-8-13-22(14-9-7-2)26-21(5)19(23)24-17-12-10-11-16-15-20(3,4)25-18(16)17/h10-12H,6-9,13-15H2,1-5H3
58 atoms
S  -1.92301 1.072146 1.163928
O  2.232551 -1.304379 1.84804
O  0.388342 -0.098526 0.038748
O  -0.238536 -2.252795 0.188572
N  -2.548212 1.846028 -0.154562
N  -1.66891 -0.594124 0.788496
C  3.296464 -2.152777 2.383414
C  4.488873 -1.940415 1.421674
C  3.821101 -1.377239 0.20419
C  2.528941 -1.034392 0.569218
C  2.791755 -3.584706 2.335385
C  3.576081 -1.698368 3.798488
C  4.266852 -1.142581 -1.082642
C  1.654225 -0.475198 -0.34402
C  3.393888 -0.566279 -2.003349
C  2.093704 -0.239961 -1.637708
C  -3.94399 1.618918 -0.513939
C  -1.668242 2.218897 -1.259655
C  -4.183619 0.477521 -1.498629
C  -0.502706 3.103291 -0.847856
C  -5.663431 0.149357 -1.676821
C  0.367503 3.476223 -2.04201
C  -0.485655 -1.078715 0.333837
C  -6.495859 1.292977 -2.240505
C  1.596658 4.277835 -1.643326
C  -2.695255 -1.575608 1.115853
H  5.018848 -2.874618 1.230345
H  5.216299 -1.233339 1.831715
H  2.581185 -3.901979 1.311841
H  1.879458 -3.700028 2.922534
H  3.541552 -4.262718 2.745035
H  4.381837 -2.295218 4.227145
H  2.699364 -1.818252 4.437039
H  3.884702 -0.652396 3.826459
H  5.277203 -1.40078 -1.374143
H  3.723485 -0.376541 -3.016056
H  1.413285 0.198727 -2.357381
H  -4.326543 2.554791 -0.932112
H  -4.500472 1.438222 0.408824
H  -2.287932 2.766722 -1.975101
H  -1.299367 1.334906 -1.793508
H  -3.748448 0.728021 -2.471351
H  -3.663158 -0.418422 -1.15258
H  -0.88881 4.009428 -0.371355
H  0.111315 2.596149 -0.100517
H  -6.080834 -0.166649 -0.715358
H  -5.74954 -0.715286 -2.339878
H  0.684507 2.56439 -2.558236
H  -0.224442 4.043982 -2.766418
H  -6.084184 1.656474 -3.18469
H  -6.549628 2.141915 -1.557217
H  -7.520916 0.972508 -2.433298
H  2.238328 3.706924 -0.969118
H  1.323239 5.202711 -1.131351
H  2.1956 4.550142 -2.513695
H  -3.617236 -1.051639 1.35036
H  -2.414026 -2.17518 1.983031
H  -2.889146 -2.244852 0.278234
elementType: S O N C H
totalener: -1514.92549896 hartree
nucrepener: 2711.97237353 hartree
electener: -4226.89787249 hartree
oneelecener: -7463.24792942 hartree
twoeener: 3236.35005693 hartree
cpcmener: -0.02728899 hartree
kineticenergy: 1509.09714240 hartree
xcener: -129.014034847202 hartree
chargesum: -0.0000000
charge: 0.019026 -0.368126 -0.314271 -0.485327 -0.144287 -0.174902 0.371572 -0.112908 -0.089948 0.250902 -0.328886 -0.293878 -0.201047 0.112213 -0.164589 -0.207869 -0.102008 -0.101636 -0.126709 -0.129213 -0.104944 -0.092373 0.486913 -0.274380 -0.284908 -0.191950 0.098370 0.090249 0.109290 0.099505 0.101316 0.099217 0.099837 0.095699 0.148721 0.155499 0.156741 0.096226 0.097976 0.103573 0.090592 0.081386 0.084184 0.077058 0.064177 0.057232 0.069916 0.053696 0.071514 0.080633 0.080043 0.091875 0.079781 0.081589 0.090126 0.105249 0.129345 0.112915
qa: 0.0190 -0.3681 -0.3143 -0.4853 -0.1443 -0.1749 0.3716 -0.1129 -0.0899 0.2509 -0.3289 -0.2939 -0.2010 0.1122 -0.1646 -0.2079 -0.1020 -0.1016 -0.1267 -0.1292 -0.1049 -0.0924 0.4869 -0.2744 -0.2849 -0.1920 0.0984 0.0902 0.1093 0.0995 0.1013 0.0992 0.0998 0.0957 0.1487 0.1555 0.1567 0.0962 0.0980 0.1036 0.0906 0.0814 0.0842 0.0771 0.0642 0.0572 0.0699 0.0537 0.0715 0.0806 0.0800 0.0919 0.0798 0.0816 0.0901 0.1052 0.1293 0.1129
va: 2.3429 2.0985 2.0883 2.0315 3.0217 3.1360 3.7030 3.9796 3.6547 3.9459 3.9772 3.9443 3.9693 3.8157 3.8987 3.9635 3.9021 3.8850 3.8158 3.8743 3.9040 3.8721 4.2643 3.9333 3.9496 3.8902 1.0035 1.0094 0.9992 1.0092 1.0063 1.0027 1.0064 1.0063 0.9991 0.9916 0.9919 0.9953 1.0098 0.9938 0.9956 1.0122 1.0088 1.0181 1.0257 1.0078 1.0058 1.0098 1.0084 1.0001 0.9986 1.0050 1.0006 1.0002 1.0040 1.0062 0.9977 0.9909
dispcorr: -0.030960082 hartree
energy: -1514.956459040673
dipole: -14.67979 14.70720 0.02741 10.27689 -9.95910 0.31780 -9.74464 9.38162 -0.36302
magnitude: 0.48325 au
magnitude: 1.22831 debye
