program: Orca
programVersion: 5.0.2
elementType: S O O O N N C C C C C C C C C C C C C C C C C C C C H H H H H H H H H H H H H H H H H H H H H H H H H H H H H H H H
charge: 0
multiplicity: 1
keywords: wb97x-d3
keywords: def2-TZVPP
keywords: def2/J RIJCOSX
keywords: DEFGRID2
keywords: scfconv7
keywords: smallprint printgap noloewdin
keywords: NOSOSCF
formula: C20H32N2O3S
InChI: InChI=1/C20H32N2O3S/c1-6-8-13-22(14-9-7-2)26-21(5)19(23)24-17-12-10-11-16-15-20(3,4)25-18(16)17/h10-12H,6-9,13-15H2,1-5H3
58 atoms
S  -1.884068 1.836477 0.948432
O  1.478009 -1.421438 0.058046
O  0.802707 1.052837 1.327348
O  0.446158 -0.622451 2.784566
N  -2.363023 1.077602 -0.445297
N  -1.288954 0.636657 2.032591
C  2.177716 -2.65102 -0.304158
C  3.643651 -2.213599 -0.524646
C  3.698393 -0.903514 0.202478
C  2.391726 -0.534962 0.478798
C  1.512612 -3.202408 -1.545871
C  2.056663 -3.599503 0.876682
C  4.744697 -0.075648 0.561247
C  2.102415 0.65364 1.124535
C  4.460064 1.125366 1.207161
C  3.148499 1.486191 1.49026
C  -3.595794 0.291979 -0.417761
C  -1.324345 0.554298 -1.330472
C  -4.474276 0.547079 -1.635321
C  -0.398861 1.624093 -1.884531
C  -5.721909 -0.327249 -1.63599
C  0.68572 1.034078 -2.77716
C  0.019457 0.274151 2.096464
C  -6.632207 -0.047675 -2.821772
C  1.677802 2.079479 -3.26293
C  -2.225669 -0.124745 2.847217
H  3.868906 -2.079685 -1.586819
H  4.344913 -2.953226 -0.136134
H  0.462666 -3.437132 -1.363233
H  2.00933 -4.122057 -1.85662
H  1.568452 -2.495541 -2.375052
H  2.547344 -4.54703 0.650085
H  1.011423 -3.80972 1.108506
H  2.528572 -3.18737 1.771122
H  5.768576 -0.350814 0.341799
H  5.26488 1.786745 1.497083
H  2.931282 2.420549 1.992671
H  -4.154091 0.559995 0.480208
H  -3.364855 -0.778273 -0.334277
H  -1.828387 0.062508 -2.165211
H  -0.747135 -0.231006 -0.828217
H  -4.761152 1.602788 -1.646647
H  -3.912551 0.368662 -2.557476
H  -0.991574 2.350243 -2.449533
H  0.06981 2.176165 -1.066659
H  -6.277465 -0.172839 -0.705792
H  -5.427849 -1.381094 -1.642709
H  1.224599 0.255136 -2.229921
H  0.225987 0.536267 -3.636535
H  -6.97428 0.989084 -2.825354
H  -7.518033 -0.684185 -2.804606
H  -6.118642 -0.226604 -3.768553
H  2.446793 1.636211 -3.897445
H  2.183742 2.56258 -2.424571
H  1.184881 2.861122 -3.844553
H  -3.179501 0.395026 2.854848
H  -1.877969 -0.203381 3.876569
H  -2.3836 -1.129973 2.453361
elementType: S O N C H
totalener: -1514.92756352 hartree
nucrepener: 2764.82265499 hartree
electener: -4279.75021851 hartree
oneelecener: -7568.75039805 hartree
twoeener: 3289.00017954 hartree
cpcmener: -0.02569949 hartree
kineticenergy: 1509.11051008 hartree
xcener: -129.014246439636 hartree
chargesum: -0.0000000
charge: 0.016777 -0.355194 -0.309862 -0.477848 -0.128779 -0.165712 0.356953 -0.129419 -0.075530 0.282625 -0.305536 -0.327246 -0.179037 0.073091 -0.154375 -0.213549 -0.092468 -0.148109 -0.102205 -0.103697 -0.083182 -0.069973 0.471425 -0.280245 -0.285555 -0.178143 0.089753 0.100699 0.101383 0.108510 0.098816 0.101769 0.099114 0.110202 0.148067 0.155190 0.146827 0.092142 0.095654 0.114063 0.090990 0.056932 0.064517 0.076926 0.062782 0.058903 0.058366 0.023341 0.071994 0.078908 0.090417 0.078811 0.090640 0.078908 0.082636 0.101850 0.114908 0.120776
qa: 0.0168 -0.3552 -0.3099 -0.4778 -0.1288 -0.1657 0.3570 -0.1294 -0.0755 0.2826 -0.3055 -0.3272 -0.1790 0.0731 -0.1544 -0.2135 -0.0925 -0.1481 -0.1022 -0.1037 -0.0832 -0.0700 0.4714 -0.2802 -0.2856 -0.1781 0.0898 0.1007 0.1014 0.1085 0.0988 0.1018 0.0991 0.1102 0.1481 0.1552 0.1468 0.0921 0.0957 0.1141 0.0910 0.0569 0.0645 0.0769 0.0628 0.0589 0.0584 0.0233 0.0720 0.0789 0.0904 0.0788 0.0906 0.0789 0.0826 0.1019 0.1149 0.1208
va: 2.3384 2.0528 2.0772 2.0355 3.0137 3.1619 3.7448 4.0041 3.6724 3.8162 3.9286 3.9747 3.9563 3.7816 3.8761 3.9930 3.9111 3.9205 3.8671 3.8307 3.8764 3.8817 4.2796 3.9513 3.9574 3.8859 1.0088 1.0037 1.0059 1.0044 1.0004 1.0065 1.0097 0.9985 0.9974 0.9896 1.0002 1.0085 0.9947 0.9914 1.0240 1.0211 1.0168 1.0183 1.0259 1.0062 1.0083 1.0186 1.0069 1.0002 1.0038 1.0008 1.0037 1.0006 1.0009 1.0100 1.0012 0.9865
dispcorr: -0.032406684 hartree
energy: -1514.959970205168
dipole: -19.16209 18.92006 -0.24203 -11.18752 9.97935 -1.20817 -27.50174 26.00434 -1.49740
magnitude: 1.93919 au
magnitude: 4.92904 debye
