program: Orca
programVersion: 5.0.2
elementType: S O O O N N C C C C C C C C C C C C C C C C C C C C H H H H H H H H H H H H H H H H H H H H H H H H H H H H H H H H
charge: 0
multiplicity: 1
keywords: wb97x-d3
keywords: def2-TZVPP
keywords: def2/J RIJCOSX
keywords: DEFGRID2
keywords: scfconv7
keywords: smallprint printgap noloewdin
keywords: NOSOSCF
formula: C20H32N2O3S
InChI: InChI=1/C20H32N2O3S/c1-6-8-13-22(14-9-7-2)26-21(5)19(23)24-17-12-10-11-16-15-20(3,4)25-18(16)17/h10-12H,6-9,13-15H2,1-5H3
58 atoms
S  -1.437383 2.290201 0.696825
O  1.446773 -1.519508 -0.330656
O  0.161784 0.132969 1.624559
O  2.175714 1.011434 1.14987
N  -2.000509 1.686264 -0.747517
N  0.281691 2.17347 0.689115
C  2.375046 -2.463656 -0.954882
C  2.370643 -3.689946 -0.014564
C  1.844177 -3.109511 1.263106
C  1.325706 -1.860322 0.961232
C  3.738275 -1.794743 -0.986096
C  1.857407 -2.764531 -2.343322
C  1.765963 -3.604762 2.550964
C  0.735383 -1.076678 1.937147
C  1.163556 -2.824891 3.535639
C  0.655476 -1.567619 3.231376
C  -2.067062 0.229394 -0.893001
C  -1.640291 2.405358 -1.970082
C  -2.98588 -0.428666 0.125543
C  -2.074214 3.862113 -1.979112
C  -3.242361 -1.905902 -0.167944
C  -1.720181 4.57017 -3.28586
C  0.970427 1.097121 1.146507
C  -2.026673 -2.806253 0.001583
C  -2.477904 4.060395 -4.504024
C  1.080076 3.285483 0.184169
H  3.367234 -4.12261 0.083838
H  1.708893 -4.478728 -0.385505
H  3.704548 -0.858465 -1.545303
H  4.46801 -2.446984 -1.467434
H  4.101587 -1.577692 0.020603
H  1.819331 -1.865459 -2.960465
H  0.858728 -3.202678 -2.309091
H  2.517353 -3.478283 -2.837678
H  2.161799 -4.582937 2.793871
H  1.093658 -3.19309 4.550392
H  0.190611 -0.962467 3.999809
H  -1.06717 -0.218126 -0.883961
H  -2.474775 0.038607 -1.8890
H  -2.13728 1.881072 -2.788312
H  -0.562405 2.331464 -2.171559
H  -2.582454 -0.323566 1.135446
H  -3.940012 0.10568 0.115139
H  -3.15399 3.916013 -1.809128
H  -1.604969 4.399334 -1.152174
H  -3.638287 -2.011135 -1.183045
H  -4.034297 -2.255882 0.499434
H  -1.924721 5.637036 -3.164653
H  -0.642763 4.490868 -3.46306
H  -2.285457 -3.849672 -0.187073
H  -1.631086 -2.748682 1.017592
H  -1.219791 -2.547196 -0.684827
H  -2.239224 3.022121 -4.73964
H  -2.23912 4.65127 -5.389945
H  -3.557744 4.122942 -4.351634
H  1.780148 3.644667 0.939049
H  0.413373 4.104058 -0.070367
H  1.639257 3.00569 -0.709389
elementType: S O N C H
totalener: -1514.92416300 hartree
nucrepener: 2784.83970123 hartree
electener: -4299.76386424 hartree
oneelecener: -7608.93343268 hartree
twoeener: 3309.16956844 hartree
cpcmener: -0.02586711 hartree
kineticenergy: 1509.07777973 hartree
xcener: -129.010571949040 hartree
chargesum: -0.0000000
charge: 0.017859 -0.358425 -0.310776 -0.480788 -0.123366 -0.164919 0.365267 -0.134292 -0.066598 0.262782 -0.326655 -0.303414 -0.179553 0.064476 -0.154785 -0.203201 -0.128577 -0.132558 -0.094749 -0.098159 -0.103390 -0.104719 0.482074 -0.259698 -0.278116 -0.185003 0.101446 0.089825 0.098985 0.101877 0.109931 0.101483 0.099416 0.106325 0.148395 0.155007 0.145230 0.077026 0.099556 0.105186 0.095562 0.067511 0.076574 0.068973 0.073277 0.055306 0.070327 0.072802 0.056238 0.097861 0.070713 0.059188 0.078988 0.091595 0.080228 0.119318 0.107866 0.117268
qa: 0.0179 -0.3584 -0.3108 -0.4808 -0.1234 -0.1649 0.3653 -0.1343 -0.0666 0.2628 -0.3267 -0.3034 -0.1796 0.0645 -0.1548 -0.2032 -0.1286 -0.1326 -0.0947 -0.0982 -0.1034 -0.1047 0.4821 -0.2597 -0.2781 -0.1850 0.1014 0.0898 0.0990 0.1019 0.1099 0.1015 0.0994 0.1063 0.1484 0.1550 0.1452 0.0770 0.0996 0.1052 0.0956 0.0675 0.0766 0.0690 0.0733 0.0553 0.0703 0.0728 0.0562 0.0979 0.0707 0.0592 0.0790 0.0916 0.0802 0.1193 0.1079 0.1173
va: 2.3292 2.0533 2.0784 2.0341 3.0464 3.1553 3.7355 4.0052 3.6508 3.8386 3.9717 3.9304 3.9618 3.7731 3.8749 3.9933 3.9262 3.9386 3.8265 3.8325 3.9161 3.9032 4.2642 3.9435 3.9340 3.8903 1.0039 1.0095 1.0098 1.0067 0.9989 1.0066 0.9987 1.0038 0.9970 0.9897 1.0006 1.0074 1.0017 0.9935 0.9885 1.0261 1.0216 1.0196 1.0275 1.0095 1.0065 1.0057 1.0087 1.0057 1.0018 1.0080 0.9987 1.0044 1.0005 0.9991 1.0007 0.9901
dispcorr: -0.033538100 hartree
energy: -1514.957701101826
dipole: -10.25509 10.07961 -0.17548 0.74670 -1.60827 -0.86157 -29.32674 27.73039 -1.59636
magnitude: 1.82249 au
magnitude: 4.63240 debye
