program: Orca
programVersion: 5.0.2
elementType: S O O O N N C C C C C C C C C C C C C C C C C C C C H H H H H H H H H H H H H H H H H H H H H H H H H H H H H H H H
charge: 0
multiplicity: 1
keywords: wb97x-d3
keywords: def2-TZVPP
keywords: def2/J RIJCOSX
keywords: DEFGRID2
keywords: scfconv7
keywords: smallprint printgap noloewdin
keywords: NOSOSCF
formula: C20H32N2O3S
InChI: InChI=1/C20H32N2O3S/c1-6-8-13-22(14-9-7-2)26-21(5)19(23)24-17-12-10-11-16-15-20(3,4)25-18(16)17/h10-12H,6-9,13-15H2,1-5H3
58 atoms
S  -1.830749 1.512563 0.769815
O  1.623869 -1.717885 0.148903
O  0.861929 0.796932 1.269941
O  0.486739 -0.783057 2.825056
N  -2.268185 0.643529 -0.562787
N  -1.241728 0.410218 1.959294
C  2.344199 -2.967822 -0.0860
C  3.826906 -2.546431 -0.211055
C  3.830376 -1.191926 0.431493
C  2.507728 -0.809487 0.586358
C  1.782949 -3.586707 -1.346667
C  2.116632 -3.845341 1.132226
C  4.849646 -0.342847 0.81924
C  2.175331 0.406836 1.155445
C  4.521861 0.89215 1.374509
C  3.193319 1.262423 1.546744
C  -3.519145 -0.112676 -0.553359
C  -1.226312 0.115114 -1.440977
C  -4.420489 0.244926 -1.728161
C  -0.300111 1.173131 -2.016671
C  -4.954353 1.669439 -1.664508
C  -1.001012 2.19844 -2.898126
C  0.06614 0.063309 2.072199
C  -5.805881 2.035998 -2.870115
C  -0.041833 3.237799 -3.458837
C  -2.189596 -0.303485 2.804418
H  4.142009 -2.485007 -1.257054
H  4.487968 -3.259679 0.283383
H  1.902093 -2.921146 -2.202929
H  0.723132 -3.823018 -1.237573
H  2.308267 -4.515675 -1.571114
H  2.61659 -4.80624 1.00432
H  1.053642 -4.037981 1.284912
H  2.512725 -3.382386 2.038353
H  5.886457 -0.628628 0.693655
H  5.305237 1.571172 1.683261
H  2.942135 2.219351 1.98714
H  -4.046818 0.095424 0.378805
H  -3.304054 -1.187584 -0.553212
H  -1.732023 -0.391751 -2.266552
H  -0.643589 -0.6578 -0.926773
H  -3.886495 0.088509 -2.671464
H  -5.257284 -0.46078 -1.738125
H  0.235853 1.682988 -1.212643
H  0.463044 0.649446 -2.601107
H  -4.119259 2.370376 -1.584388
H  -5.542231 1.791872 -0.749235
H  -1.509053 1.684988 -3.720917
H  -1.783794 2.702537 -2.325441
H  -6.192218 3.053338 -2.79105
H  -6.663371 1.367724 -2.974066
H  -5.230533 1.976312 -3.796328
H  -0.561043 3.965469 -4.084541
H  0.736413 2.777086 -4.070829
H  0.455153 3.790019 -2.658434
H  -3.139223 0.223663 2.781167
H  -1.848057 -0.333142 3.838164
H  -2.352244 -1.325801 2.459925
elementType: S O N C H
totalener: -1514.92666750 hartree
nucrepener: 2753.87787905 hartree
electener: -4268.80454655 hartree
oneelecener: -7547.07340581 hartree
twoeener: 3278.26885926 hartree
cpcmener: -0.02550976 hartree
kineticenergy: 1509.10131962 hartree
xcener: -129.014620849436 hartree
chargesum: -0.0000000
charge: 0.017390 -0.367143 -0.314333 -0.480991 -0.141809 -0.157873 0.358693 -0.123423 -0.087613 0.301925 -0.304777 -0.328070 -0.192207 0.077793 -0.150083 -0.210656 -0.100782 -0.143469 -0.114578 -0.125075 -0.092277 -0.059986 0.469323 -0.280559 -0.289397 -0.185196 0.090137 0.099836 0.097578 0.100727 0.105706 0.101110 0.099293 0.109872 0.148750 0.155037 0.147027 0.093904 0.111209 0.109524 0.107040 0.063814 0.079864 0.062891 0.075923 0.054992 0.063494 0.058931 0.050007 0.090388 0.079020 0.079155 0.090076 0.080580 0.079893 0.102208 0.114038 0.123147
qa: 0.0174 -0.3671 -0.3143 -0.4810 -0.1418 -0.1579 0.3587 -0.1234 -0.0876 0.3019 -0.3048 -0.3281 -0.1922 0.0778 -0.1501 -0.2107 -0.1008 -0.1435 -0.1146 -0.1251 -0.0923 -0.0600 0.4693 -0.2806 -0.2894 -0.1852 0.0901 0.0998 0.0976 0.1007 0.1057 0.1011 0.0993 0.1099 0.1487 0.1550 0.1470 0.0939 0.1112 0.1095 0.1070 0.0638 0.0799 0.0629 0.0759 0.0550 0.0635 0.0589 0.0500 0.0904 0.0790 0.0792 0.0901 0.0806 0.0799 0.1022 0.1140 0.1231
va: 2.3586 2.0703 2.0742 2.0315 2.9664 3.1784 3.7425 3.9950 3.6791 3.8514 3.9280 3.9750 3.9590 3.7772 3.8725 4.0084 3.9159 3.9228 3.8639 3.8412 3.8458 3.8571 4.2829 3.9515 3.9599 3.8895 1.0083 1.0037 1.0059 1.0057 1.0038 1.0066 1.0093 0.9990 0.9977 0.9898 1.0001 1.0030 1.0001 0.9955 1.0214 1.0113 1.0157 1.0230 1.0152 1.0161 1.0093 1.0072 1.0138 1.0035 1.0006 1.0010 1.0033 1.0006 1.0003 1.0103 1.0024 0.9848
dispcorr: -0.032049444 hartree
energy: -1514.958716946869
dipole: -21.44086 21.21288 -0.22797 -2.51638 1.28979 -1.22659 -27.30411 25.88638 -1.41772
magnitude: 1.88850 au
magnitude: 4.80018 debye
