program: Orca
programVersion: 5.0.2
elementType: S O O O N N C C C C C C C C C C C C C C C C C C C C H H H H H H H H H H H H H H H H H H H H H H H H H H H H H H H H
charge: 0
multiplicity: 1
keywords: wb97x-d3
keywords: def2-TZVPP
keywords: def2/J RIJCOSX
keywords: DEFGRID2
keywords: scfconv7
keywords: smallprint printgap noloewdin
keywords: NOSOSCF
formula: C20H32N2O3S
InChI: InChI=1/C20H32N2O3S/c1-6-8-13-22(14-9-7-2)26-21(5)19(23)24-17-12-10-11-16-15-20(3,4)25-18(16)17/h10-12H,6-9,13-15H2,1-5H3
58 atoms
S  -1.97677 2.267833 0.751136
O  1.049397 -1.325894 -0.307305
O  0.58005 1.115016 1.07987
O  0.016718 -0.525542 2.51104
N  -2.358771 1.737786 -0.765883
N  -1.557691 0.919229 1.7453
C  1.614482 -2.620047 -0.688202
C  3.140259 -2.376225 -0.754019
C  3.298863 -1.119238 0.04701
C  2.031624 -0.592817 0.23646
C  1.005846 -3.007751 -2.017659
C  1.257071 -3.605544 0.411627
C  4.406364 -0.458207 0.543822
C  1.840512 0.583855 0.937181
C  4.222135 0.735882 1.237708
C  2.946921 1.251473 1.438212
C  -3.645521 1.095714 -1.002305
C  -1.287863 1.351989 -1.683017
C  -3.661529 -0.420576 -0.850229
C  -0.284736 2.459268 -1.951793
C  -5.02488 -1.012822 -1.181634
C  0.850429 1.982101 -2.849268
C  -0.297518 0.42255 1.830419
C  -5.044222 -2.529484 -1.071131
C  1.865529 3.075637 -3.139332
C  -2.567866 0.282689 2.580052
H  3.481413 -2.230209 -1.783336
H  3.697731 -3.220777 -0.346361
H  -0.07752 -3.117392 -1.943229
H  1.413831 -3.963054 -2.34946
H  1.225309 -2.265483 -2.786673
H  1.689237 -3.310918 1.37027
H  1.639224 -4.597627 0.167718
H  0.175725 -3.683686 0.534301
H  5.402027 -0.857756 0.397328
H  5.076206 1.267332 1.635534
H  2.807932 2.176259 1.984117
H  -3.955199 1.353689 -2.020997
H  -4.378176 1.548796 -0.331179
H  -1.769844 1.081036 -2.626415
H  -0.77355 0.448949 -1.338161
H  -2.907684 -0.867168 -1.506387
H  -3.384064 -0.697486 0.170067
H  -0.800146 3.304398 -2.418592
H  0.132253 2.830581 -1.013178
H  -5.314071 -0.717861 -2.195248
H  -5.780926 -0.586932 -0.514717
H  1.353974 1.133339 -2.37495
H  0.441321 1.603916 -3.791482
H  -6.026958 -2.93669 -1.313782
H  -4.793652 -2.858524 -0.060576
H  -4.322976 -2.985389 -1.752517
H  2.320098 3.448544 -2.219274
H  1.402309 3.925651 -3.644611
H  2.671778 2.714649 -3.779663
H  -2.686569 -0.773912 2.339578
H  -3.518575 0.780401 2.413802
H  -2.319847 0.372098 3.638355
elementType: S O N C H
totalener: -1514.92754465 hartree
nucrepener: 2799.65967775 hartree
electener: -4314.58722240 hartree
oneelecener: -7638.51420201 hartree
twoeener: 3323.92697962 hartree
cpcmener: -0.02574730 hartree
kineticenergy: 1509.10088569 hartree
xcener: -129.014574391598 hartree
chargesum: -0.0000000
charge: 0.016871 -0.359360 -0.312258 -0.482266 -0.134037 -0.167751 0.362594 -0.129165 -0.076352 0.281961 -0.304448 -0.326579 -0.183955 0.071021 -0.153912 -0.208459 -0.103065 -0.102349 -0.101237 -0.124905 -0.085437 -0.072355 0.481326 -0.271470 -0.288538 -0.193476 0.090535 0.099536 0.099876 0.105305 0.096908 0.109966 0.101837 0.099047 0.149197 0.154942 0.146521 0.088792 0.094944 0.105403 0.072392 0.072825 0.066662 0.076335 0.064825 0.057605 0.059127 0.045278 0.065553 0.091496 0.078621 0.077802 0.079301 0.080275 0.090162 0.112310 0.107233 0.126990
qa: 0.0169 -0.3594 -0.3123 -0.4823 -0.1340 -0.1678 0.3626 -0.1292 -0.0764 0.2820 -0.3044 -0.3266 -0.1840 0.0710 -0.1539 -0.2085 -0.1031 -0.1023 -0.1012 -0.1249 -0.0854 -0.0724 0.4813 -0.2715 -0.2885 -0.1935 0.0905 0.0995 0.0999 0.1053 0.0969 0.1100 0.1018 0.0990 0.1492 0.1549 0.1465 0.0888 0.0949 0.1054 0.0724 0.0728 0.0667 0.0763 0.0648 0.0576 0.0591 0.0453 0.0656 0.0915 0.0786 0.0778 0.0793 0.0803 0.0902 0.1123 0.1072 0.1270
va: 2.3511 2.0600 2.0751 2.0320 3.0307 3.1463 3.7371 4.0037 3.6814 3.8398 3.9321 3.9741 3.9586 3.7671 3.8719 4.0074 3.9314 3.9095 3.7950 3.8684 3.8930 3.8751 4.2669 3.9404 3.9562 3.8878 1.0084 1.0036 1.0059 1.0042 1.0047 0.9990 1.0063 1.0093 0.9969 0.9895 0.9995 0.9998 1.0118 0.9956 1.0060 1.0144 1.0046 1.0165 1.0271 1.0098 1.0069 1.0089 1.0069 1.0041 1.0013 1.0017 1.0005 1.0004 1.0038 0.9859 1.0081 0.9989
dispcorr: -0.032804598 hartree
energy: -1514.960349248548
dipole: -14.35670 14.13105 -0.22566 -13.57128 12.54741 -1.02387 -23.16007 21.52977 -1.63030
magnitude: 1.93833 au
magnitude: 4.92683 debye
