program: Orca
programVersion: 5.0.2
elementType: S O O O N N C C C C C C C C C C C C C C C C C C C C H H H H H H H H H H H H H H H H H H H H H H H H H H H H H H H H
charge: 0
multiplicity: 1
keywords: wb97x-d3
keywords: def2-TZVPP
keywords: def2/J RIJCOSX
keywords: DEFGRID2
keywords: scfconv7
keywords: smallprint printgap noloewdin
keywords: NOSOSCF
formula: C20H32N2O3S
InChI: InChI=1/C20H32N2O3S/c1-6-8-13-22(14-9-7-2)26-21(5)19(23)24-17-12-10-11-16-15-20(3,4)25-18(16)17/h10-12H,6-9,13-15H2,1-5H3
58 atoms
S  -2.161728 0.751652 0.40088
O  1.298162 -2.5040 1.653683
O  0.397705 -0.366559 0.002045
O  1.461876 0.63041 1.713371
N  -2.238444 1.785088 -0.879713
N  -0.729978 1.066458 1.313006
C  2.175519 -3.434945 2.362388
C  3.15746 -3.949337 1.284665
C  3.028386 -2.910565 0.212594
C  1.916897 -2.142231 0.520821
C  1.308556 -4.526101 2.949463
C  2.897017 -2.636265 3.434163
C  3.756568 -2.654244 -0.933643
C  1.52503 -1.09655 -0.293972
C  3.356729 -1.611438 -1.766689
C  2.250332 -0.834205 -1.446098
C  -1.444592 1.521076 -2.077105
C  -2.659115 3.165251 -0.677302
C  -1.689237 0.15017 -2.687827
C  -1.529935 4.167573 -0.465675
C  -3.134307 -0.098425 -3.098177
C  -2.037656 5.568217 -0.133888
C  0.455914 0.454633 1.066795
C  -3.326072 -1.451214 -3.766725
C  -2.848624 6.218252 -1.24682
C  -0.772535 1.979921 2.44705
H  2.864042 -4.935098 0.911105
H  4.170869 -4.041113 1.678158
H  0.594518 -4.12673 3.67155
H  1.931663 -5.255658 3.467805
H  0.75483 -5.054161 2.171892
H  3.561383 -3.285164 4.006145
H  2.190247 -2.181988 4.130331
H  3.504005 -1.840406 2.997401
H  4.622912 -3.253426 -1.184602
H  3.913926 -1.395381 -2.668471
H  1.946444 -0.019175 -2.091658
H  -0.374602 1.661216 -1.885962
H  -1.723718 2.284642 -2.808819
H  -3.336985 3.184747 0.179223
H  -3.251395 3.452175 -1.551429
H  -1.040724 0.071204 -3.566271
H  -1.362182 -0.634647 -2.002029
H  -0.885027 3.82275 0.34636
H  -0.900557 4.214175 -1.360214
H  -3.461046 0.695411 -3.777503
H  -3.784022 -0.033811 -2.221948
H  -2.636975 5.528709 0.781063
H  -1.178248 6.202597 0.097222
H  -2.72264 -1.539312 -4.672597
H  -4.367226 -1.613723 -4.049773
H  -3.037163 -2.267483 -3.101323
H  -2.285182 6.247864 -2.182066
H  -3.110317 7.246178 -0.991305
H  -3.782967 5.690475 -1.443227
H  -0.512386 1.46919 3.373697
H  -1.783461 2.361905 2.544191
H  -0.097584 2.824315 2.312265
elementType: S O N C H
totalener: -1514.92560685 hartree
nucrepener: 2699.32137655 hartree
electener: -4214.24698340 hartree
oneelecener: -7438.02804039 hartree
twoeener: 3223.78105699 hartree
cpcmener: -0.02711084 hartree
kineticenergy: 1509.10865239 hartree
xcener: -129.017831067706 hartree
chargesum: 0.0000000
charge: 0.015493 -0.368388 -0.315197 -0.486922 -0.149159 -0.164175 0.372184 -0.115365 -0.084642 0.248670 -0.292709 -0.328287 -0.205190 0.089402 -0.154242 -0.184540 -0.114636 -0.098436 -0.140986 -0.116723 -0.065833 -0.105721 0.484914 -0.283442 -0.274945 -0.191064 0.090534 0.098219 0.099260 0.099396 0.095978 0.100638 0.099374 0.109799 0.148817 0.155790 0.144835 0.110523 0.106688 0.095652 0.095113 0.076647 0.064230 0.080420 0.077489 0.058338 0.052083 0.057488 0.070683 0.078151 0.089421 0.079906 0.080928 0.091303 0.079717 0.125198 0.105057 0.112263
qa: 0.0155 -0.3684 -0.3152 -0.4869 -0.1492 -0.1642 0.3722 -0.1154 -0.0846 0.2487 -0.2927 -0.3283 -0.2052 0.0894 -0.1542 -0.1845 -0.1146 -0.0984 -0.1410 -0.1167 -0.0658 -0.1057 0.4849 -0.2834 -0.2749 -0.1911 0.0905 0.0982 0.0993 0.0994 0.0960 0.1006 0.0994 0.1098 0.1488 0.1558 0.1448 0.1105 0.1067 0.0957 0.0951 0.0766 0.0642 0.0804 0.0775 0.0583 0.0521 0.0575 0.0707 0.0782 0.0894 0.0799 0.0809 0.0913 0.0797 0.1252 0.1051 0.1123
va: 2.3640 2.0979 2.0873 2.0291 3.0009 3.1582 3.6985 3.9810 3.6501 3.9565 3.9453 3.9769 3.9622 3.8558 3.8727 3.9725 3.8875 3.8917 3.8847 3.8277 3.8527 3.9060 4.2664 3.9510 3.9332 3.8911 1.0091 1.0038 1.0065 1.0027 1.0062 1.0066 1.0089 0.9989 0.9993 0.9910 0.9995 1.0005 0.9924 1.0105 0.9962 1.0130 1.0234 1.0107 1.0127 1.0095 1.0206 1.0078 1.0055 1.0006 1.0038 1.0005 1.0003 1.0049 0.9990 0.9995 1.0088 0.9866
dispcorr: -0.030517367 hartree
energy: -1514.956124217869
dipole: -14.57391 14.55366 -0.02026 14.93308 -14.82367 0.10941 -9.24981 8.77245 -0.47736
magnitude: 0.49016 au
magnitude: 1.24588 debye
