program: Orca
programVersion: 5.0.2
elementType: S O O O N N C C C C C C C C C C C C C C C C C C C C H H H H H H H H H H H H H H H H H H H H H H H H H H H H H H H H
charge: 0
multiplicity: 1
keywords: wb97x-d3
keywords: def2-TZVPP
keywords: def2/J RIJCOSX
keywords: DEFGRID2
keywords: scfconv7
keywords: smallprint printgap noloewdin
keywords: NOSOSCF
formula: C20H32N2O3S
InChI: InChI=1/C20H32N2O3S/c1-6-8-13-22(14-9-7-2)26-21(5)19(23)24-17-12-10-11-16-15-20(3,4)25-18(16)17/h10-12H,6-9,13-15H2,1-5H3
58 atoms
S  -1.086984 2.800008 0.271194
O  0.760289 -1.50819 0.302248
O  1.269347 1.270822 0.615273
O  0.837956 0.462007 2.669065
N  -1.779391 1.817265 -0.862357
N  -0.635341 1.856321 1.646682
C  0.895023 -2.964017 0.34659
C  2.332225 -3.240715 -0.154067
C  2.994336 -1.906539 0.013459
C  1.993187 -0.981648 0.258111
C  -0.176525 -3.548715 -0.546629
C  0.721744 -3.383107 1.796244
C  4.312335 -1.497412 -0.068694
C  2.282345 0.359557 0.43688
C  4.60976 -0.14726 0.103953
C  3.601961 0.775382 0.359805
C  -0.90096 1.077057 -1.766995
C  -3.080633 1.223279 -0.566305
C  -1.507847 0.866515 -3.146133
C  -3.023156 -0.190725 0.005209
C  -0.590612 0.054642 -4.058209
C  -4.399275 -0.723399 0.396134
C  0.511983 1.138932 1.722613
C  0.770965 0.688533 -4.309872
C  -5.025855 -0.014634 1.589015
C  -1.524101 1.800836 2.80029
H  2.340324 -3.553146 -1.20261
H  2.809347 -4.034491 0.422542
H  -0.082506 -4.634753 -0.578335
H  -0.087909 -3.176307 -1.568521
H  -1.176623 -3.314285 -0.177581
H  1.491367 -2.944228 2.434747
H  0.794664 -4.467794 1.886189
H  -0.253568 -3.079517 2.179869
H  5.102604 -2.210705 -0.266408
H  5.635371 0.191811 0.045617
H  3.837952 1.823213 0.497662
H  -0.619434 0.105978 -1.345755
H  0.016169 1.656656 -1.863416
H  -3.680235 1.212852 -1.481671
H  -3.591581 1.898042 0.121569
H  -2.463757 0.34185 -3.068185
H  -1.721337 1.838954 -3.600888
H  -2.586552 -0.864056 -0.73792
H  -2.357715 -0.221996 0.873603
H  -1.099399 -0.093442 -5.014112
H  -0.453011 -0.945061 -3.633696
H  -5.072707 -0.661658 -0.464906
H  -4.307107 -1.787962 0.626687
H  0.672604 1.716121 -4.667341
H  1.3263 0.131756 -5.066284
H  1.390961 0.710274 -3.412178
H  -4.376621 -0.068825 2.465588
H  -5.977917 -0.473421 1.860847
H  -5.224275 1.039774 1.390687
H  -1.104045 2.338552 3.653219
H  -1.725302 0.772651 3.103325
H  -2.468001 2.270388 2.535513
elementType: S O N C H
totalener: -1514.92341594 hartree
nucrepener: 2824.55374774 hartree
electener: -4339.47716367 hartree
oneelecener: -7688.06065644 hartree
twoeener: 3348.58349277 hartree
cpcmener: -0.02611184 hartree
kineticenergy: 1509.08557292 hartree
xcener: -129.014062379332 hartree
chargesum: 0.0000000
charge: 0.014530 -0.363897 -0.317495 -0.478941 -0.132547 -0.164569 0.357816 -0.121919 -0.108505 0.314865 -0.314136 -0.329165 -0.187364 0.085441 -0.150945 -0.209898 -0.100753 -0.126099 -0.103765 -0.102965 -0.107608 -0.098386 0.471746 -0.275272 -0.281196 -0.187226 0.090624 0.099381 0.112480 0.098332 0.099797 0.110949 0.102451 0.099526 0.148318 0.154744 0.146760 0.052767 0.100342 0.103152 0.099353 0.075831 0.072509 0.078202 0.066476 0.072624 0.055495 0.057699 0.070242 0.082147 0.092156 0.078582 0.077762 0.096372 0.081223 0.131583 0.108226 0.102148
qa: 0.0145 -0.3639 -0.3175 -0.4789 -0.1325 -0.1646 0.3578 -0.1219 -0.1085 0.3149 -0.3141 -0.3292 -0.1874 0.0854 -0.1509 -0.2099 -0.1008 -0.1261 -0.1038 -0.1030 -0.1076 -0.0984 0.4717 -0.2753 -0.2812 -0.1872 0.0906 0.0994 0.1125 0.0983 0.0998 0.1109 0.1025 0.0995 0.1483 0.1547 0.1468 0.0528 0.1003 0.1032 0.0994 0.0758 0.0725 0.0782 0.0665 0.0726 0.0555 0.0577 0.0702 0.0821 0.0922 0.0786 0.0778 0.0964 0.0812 0.1316 0.1082 0.1021
va: 2.3374 2.0641 2.0777 2.0353 3.0652 3.1375 3.7349 3.9965 3.6895 3.8427 3.9343 3.9789 3.9540 3.7829 3.8755 4.0089 3.9478 3.9176 3.8478 3.8177 3.8978 3.9070 4.2810 3.9346 3.9312 3.8869 1.0079 1.0038 1.0052 1.0033 1.0031 0.9986 1.0064 1.0073 0.9976 0.9897 1.0003 1.0127 1.0103 0.9919 1.0135 1.0138 1.0165 1.0119 1.0142 1.0072 1.0097 1.0087 1.0060 1.0016 1.0047 0.9959 1.0006 1.0063 0.9988 0.9966 0.9922 1.0081
dispcorr: -0.034511495 hartree
energy: -1514.957927430741
dipole: -24.16386 23.32521 -0.83865 -17.29572 15.64572 -1.65000 -13.55883 12.37876 -1.18006
magnitude: 2.19508 au
magnitude: 5.57945 debye
