program: Orca
programVersion: 5.0.2
elementType: S O O O N N C C C C C C C C C C C C C C C C C C C C H H H H H H H H H H H H H H H H H H H H H H H H H H H H H H H H
charge: 0
multiplicity: 1
keywords: wb97x-d3
keywords: def2-TZVPP
keywords: def2/J RIJCOSX
keywords: DEFGRID2
keywords: scfconv7
keywords: smallprint printgap noloewdin
keywords: NOSOSCF
formula: C20H32N2O3S
InChI: InChI=1/C20H32N2O3S/c1-6-8-13-22(14-9-7-2)26-21(5)19(23)24-17-12-10-11-16-15-20(3,4)25-18(16)17/h10-12H,6-9,13-15H2,1-5H3
58 atoms
S  -1.840688 1.325971 1.193131
O  2.241795 -1.25891 1.849378
O  0.376515 -0.027811 0.073737
O  -0.369638 -2.132086 0.337204
N  -2.452852 2.057129 -0.155519
N  -1.681548 -0.368716 0.907292
C  3.271884 -2.159438 2.367385
C  4.42276 -2.068606 1.338908
C  3.72693 -1.521113 0.129939
C  2.482578 -1.071699 0.544011
C  2.670712 -3.554013 2.405139
C  3.657042 -1.670596 3.745592
C  4.113201 -1.386218 -1.189884
C  1.596002 -0.502315 -0.351434
C  3.22852 -0.801217 -2.093938
C  1.976215 -0.366565 -1.67788
C  -3.862227 1.875409 -0.482703
C  -1.571622 2.340363 -1.285919
C  -4.179626 0.696699 -1.396768
C  -0.372546 3.200159 -0.921906
C  -5.679775 0.527936 -1.602557
C  0.494397 3.507547 -2.136638
C  -0.5439 -0.940334 0.437255
C  -6.019495 -0.634584 -2.522313
C  1.736877 4.308095 -1.778692
C  -2.747129 -1.275613 1.315318
H  4.884453 -3.04209 1.167968
H  5.211613 -1.390201 1.67765
H  3.39373 -4.265389 2.806179
H  2.387326 -3.895938 1.407448
H  1.78376 -3.584098 3.039954
H  4.038111 -0.648964 3.712404
H  4.441497 -2.305736 4.158404
H  2.809789 -1.70153 4.432651
H  5.085464 -1.72985 -1.520029
H  3.510454 -0.689705 -3.132309
H  1.285863 0.077534 -2.384696
H  -4.213744 2.799289 -0.954539
H  -4.410937 1.776793 0.456529
H  -2.177046 2.876305 -2.022208
H  -1.240525 1.418505 -1.778582
H  -3.694093 0.837136 -2.367739
H  -3.767831 -0.224408 -0.976146
H  -0.724471 4.133672 -0.472283
H  0.234844 2.699841 -0.164385
H  -6.100757 1.452045 -2.010934
H  -6.162916 0.377093 -0.632126
H  0.794255 2.5703 -2.616213
H  -0.093734 4.053892 -2.880354
H  -5.634335 -1.577738 -2.129373
H  -5.590606 -0.494095 -3.516549
H  -7.098025 -0.746705 -2.64369
H  2.371397 3.760827 -1.07871
H  1.478105 5.260135 -1.310829
H  2.337974 4.529824 -2.661805
H  -3.03122 -1.949434 0.507207
H  -3.618343 -0.687599 1.588793
H  -2.454195 -1.872391 2.180549
elementType: S O N C H
totalener: -1514.92711704 hartree
nucrepener: 2710.40201968 hartree
electener: -4225.32913672 hartree
oneelecener: -7460.11794963 hartree
twoeener: 3234.78881291 hartree
cpcmener: -0.02730180 hartree
kineticenergy: 1509.09468334 hartree
xcener: -129.012688072572 hartree
chargesum: 0.0000000
charge: 0.019092 -0.368310 -0.316832 -0.485728 -0.139998 -0.174064 0.371461 -0.111133 -0.086588 0.243071 -0.328199 -0.294604 -0.204591 0.117586 -0.161397 -0.207294 -0.100409 -0.103026 -0.113624 -0.126552 -0.082387 -0.088667 0.488658 -0.272211 -0.284741 -0.191553 0.098457 0.089838 0.101022 0.109182 0.099392 0.096119 0.099220 0.100247 0.148622 0.155456 0.155287 0.092235 0.093692 0.103199 0.090303 0.078410 0.066058 0.075489 0.063693 0.058834 0.058745 0.052644 0.069206 0.078522 0.078405 0.090937 0.080167 0.080718 0.090124 0.112389 0.106333 0.129093
qa: 0.0191 -0.3683 -0.3168 -0.4857 -0.1400 -0.1741 0.3715 -0.1111 -0.0866 0.2431 -0.3282 -0.2946 -0.2046 0.1176 -0.1614 -0.2073 -0.1004 -0.1030 -0.1136 -0.1266 -0.0824 -0.0887 0.4887 -0.2722 -0.2847 -0.1916 0.0985 0.0898 0.1010 0.1092 0.0994 0.0961 0.0992 0.1002 0.1486 0.1555 0.1553 0.0922 0.0937 0.1032 0.0903 0.0784 0.0661 0.0755 0.0637 0.0588 0.0587 0.0526 0.0692 0.0785 0.0784 0.0909 0.0802 0.0807 0.0901 0.1124 0.1063 0.1291
va: 2.3452 2.0985 2.0876 2.0303 3.0221 3.1409 3.7037 3.9757 3.6494 3.9590 3.9768 3.9436 3.9709 3.8198 3.8965 3.9677 3.9240 3.8892 3.7953 3.8758 3.8863 3.8729 4.2616 3.9412 3.9503 3.8854 1.0036 1.0096 1.0064 0.9991 1.0091 1.0062 1.0028 1.0063 0.9992 0.9917 0.9927 0.9994 1.0114 0.9937 0.9951 1.0124 1.0041 1.0181 1.0257 1.0093 1.0072 1.0101 1.0084 1.0012 1.0016 1.0042 1.0006 1.0003 1.0040 0.9903 1.0068 0.9982
dispcorr: -0.030609195 hartree
energy: -1514.957726231077
dipole: -13.50131 13.55103 0.04972 7.14597 -6.84310 0.30287 -10.50025 10.09623 -0.40402
magnitude: 0.50737 au
magnitude: 1.28964 debye
